{"text_format":"1","workbook":"xlsx","n_sheets":5,"sheets":["Settings","Graph","Info","Calcs","Revisions"],"not_rendered":{"charts":1,"images":0,"macros":1,"external_links":0,"defined_names":116,"comments":0,"pivot_tables":0},"unopened":[],"bounds":{"document_bytes":16777216,"sheet_cells":100000,"rows_first":2000,"rows_last":500,"rows_between":2000,"halvings":0,"cell_chars":16384,"cell_head_chars":4096},"cells_cut":0,"cells_raw":0,"read":"whole","date_system":"1900"}

{"sheet":"Settings","index":0,"n_rows":27,"n_cols":29,"rows_kept":27,"cut":false,"hidden":false,"merged":[]}
[]
[null,null,"Test Conditions",null,null,null,"T401L QUADRILATERAL TESTING SPREADSHEET",null,null,null,null,null,null,"version 1.09",null,null,null,null,null,null,null,null,null,null,null,"F",null,null,5]
[null,null,"INOM",5,"A secondary",null,"This spreadsheet helps users test the quadrilateral elements in the SEL-T401L.  Enable macros for best experience!",null,null,null,null,null,null,null,null,null,null,null,null,null,null,null,null,null,null,"R",null,null,1]
[null,null,"Fault Type","SLG",null,null,"It is provided as-is, without warranty, either expressed or implied. Its use is the sole responsibility of the user.",null,null,null,null,null,null,null,null,null,null,null,null,null,null,null,null,null,null,null,null,null,"ABC"]
[null,null,"Zone",1,null,null,"Refer to application guide AG 2021-XX  for more information (available at https://www.selinc.com).",null,null,null,null,null,null,null,null,null,null,null,null,null,null,null,null,null,null,null,null,null,"ACB"]
[null,null,null,null,null,null,null,null,null,null,null,null,null,null,null,null,null,null,null,null,null,null,null,null,null,null,null,null,"SLG"]
[null,null,"Relay Settings",null,null,null,null,null,null,null,null,null,null,null,null,null,null,null,null,null,null,null,null,null,null,null,null,null,"PH-PH"]
[null,null,"PHROT","ABC",null,null,"Settings Instructions",null,null,null,null,null,null,null,null,null,null,null,null,null,null,null,null,null,null,null,null,null,"3PH"]
[null,null,"VNOMY",115,"L-L V secondary",null,"1. Enable macros if prompted.  See the Info worksheet for more information.",null,null,null,null,null,null,null,null,null,null,null,null,null,null,null,null,null,null,null,null,null,1]
[null,null,"Z1MAG",5,"Ω secondary",null,"2. Only modify yellow cells in this spreadsheet.",null,null,null,null,null,null,null,null,null,null,null,null,null,null,null,null,"Z1MAG RANGE",null,{"$f":"IF(_INOMset=5,0.05,0.25)","v":0.05},{"$f":"IF(_INOMset=5,255,1275)","v":255},null,2]
[null,null,"Z1ANG",80,"degrees",null,"3. Parameters for the second reactance blinder will appear below if applicable.",null,null,null,null,null,null,null,null,null,null,null,null,null,null,null,null,null,null,null,null,null,3]
[null,null,null,null,null,null,null,null,null,null,null,null,null,null,null,null,null,null,null,null,null,null,null,null,null,null,null,null,4]
[null,null,"ZDIRn","F",null,null,"Second Reactance Test Circle",null,null,null,null,null,null,null,null,null,null,null,null,null,null,null,null,null,null,null,null,null,5]
[null,null,"Zxn",3,"Ω secondary",null,"Radius",{"$f":"IF(OR(AND(_H=1,_ZONE=1,ISNUMBER(_rc)),AND(_H=1,_ZONE=2,_EPILOTset<>\"N\",ISNUMBER(_rc))),_rc,\"NA\")","v":16.933521374007107},"Ω secondary",null,null,null,null,null,null,null,null,null,null,null,null,null,null,"ZXn RANGE",null,{"$f":"IF(_INOMset=5,0.05,0.25)","v":0.05},{"$f":"IF(_INOMset=5,64,320)","v":64},null,"N"]
[null,null,"ZxnR",10,"Ω secondary",null,"Center",{"$f":"IF(OR(AND(_H=1,_ZONE=1,ISNUMBER(_rc)),AND(_H=1,_ZONE=2,_EPILOTset<>\"N\",ISNUMBER(_rc))),IMABS(COMPLEX(_hc,_kc)),\"NA\")","v":13.967067149708953},"∠",{"$f":"IF(OR(AND(_H=1,_ZONE=1,ISNUMBER(_rc)),AND(_H=1,_ZONE=2,_EPILOTset<>\"N\",ISNUMBER(_rc))),DEGREES(IMARGUMENT(COMPLEX(_hc,_kc))),\"NA\")","v":-90.550163731939818},"degrees",null,null,null,null,null,null,null,null,null,null,null,null,"ZXnR RANGE",null,{"$f":"IF(_INOMset=5,0.05,0.25)","v":0.05},{"$f":"IF(_INOMset=5,64,320)","v":64},null,"POTT"]
[null,null,"Zx5REV",4,"Ω secondary",null,null,null,null,null,null,null,null,null,null,null,null,null,null,null,null,null,null,"ZX5REV RANGE",null,{"$f":"IF(_INOMset=5,0.05,0.25)","v":0.05},{"$f":"IF(_INOMset=5,64,320)","v":64},null,"DCB"]
[null,null,"ZxnTANG",-3,"degrees"]
[null,null,"Zx1TANG",-3,"degrees"]
[null,null,"k0Mn",0.72699999999999998]
[null,null,"k0An",-3.65,"degrees"]
[null,null,"ZGn_50P",0.5,"A secondary",null,null,null,null,null,null,null,null,null,null,null,null,null,null,null,null,null,null,"ZGn_50P RANGE",null,{"$f":"IF(_INOMset=5,0.5,0.1)","v":0.5},{"$f":"IF(_INOMset=5,100,20)","v":100}]
[null,null,"ZGn_50G",0.5,"A secondary",null,null,null,null,null,null,null,null,null,null,null,null,null,null,null,null,null,null,"ZGn_50G RANGE",null,{"$f":"IF(_INOMset=5,0.5,0.1)","v":0.5},{"$f":"IF(_INOMset=5,100,20)","v":100}]
[null,null,"ZPn_50PP",0.5,"A secondary",null,null,null,null,null,null,null,null,null,null,null,null,null,null,null,null,null,null,"ZPn_50PP RANGE",null,{"$f":"IF(_INOMset=5,0.5,0.1)","v":0.5},{"$f":"IF(_INOMset=5,100,20)","v":100}]
[null,null,"EPILOT","POTT"]
[]
[null,null,"Where :","x=G or P"]
[null,null,null,"n=1,2,3,4,5"]

{"sheet":"Graph","index":1,"n_rows":28,"n_cols":25,"rows_kept":28,"cut":false,"hidden":false,"merged":[[1,13,1,14],[12,13,12,14],[24,13,24,17],[7,17,7,22],[12,21,13,22]]}
[]
[null,null,null,null,null,null,null,null,null,null,null,null,null,"Graph Controls",null,null,null,"Reactance Comparator Check",null,null,null,null,null,null,"Graph Instructions"]
[null,null,null,null,null,null,null,null,null,null,null,null,null,null,null,null,null,"Reactance Comparator Condition (Asserted/Deasserted):",null,null,null,null,null,null,"1. The graph shows the following (colors):"]
[null,null,null,null,null,null,null,null,null,null,null,null,null,null,null,null,null,"X1 (self-polarized reactance)",null,null,null,null,{"$f":"IF(IF(EXACT(_ZONE,\"5\"),AND(_X1<_ZXnset,_X1>-_ZX5REVset),IF(_H>0,_X1<_ZXnset,_X1>-_ZXnset)),\"ASSERTED\",\"DEASSERTED\")","v":"ASSERTED"},null,"•Line angle"]
[null,null,null,null,null,null,null,null,null,null,null,null,null,null,null,null,null,"X2 (I2, I0, and V1 polarized reactance)",null,null,null,null,{"$f":"IF(ISERROR(IF(IF(OR(AND(_H=1,_ZONE=1),AND(_H=1,_ZONE=2,_EPILOTset<>\"N\")), _X2<_ZXnset,\"N/A\"),\"ASSERTED\",\"DEASSERTED\")),\"N/A\",IF(IF(OR(AND(_H=1,_ZONE=1),AND(_H=1,_ZONE=2,_EPILOTset<>\"N\")), _X2<_ZXnset,\"N/A\"),\"ASSERTED\",\"DEASSERTED\"))","v":"ASSERTED"},null,"•Test impedance (X) and vector"]
[null,null,null,null,null,null,null,null,null,null,null,null,null,null,null,null,null,"RB (resistance blinder)",null,null,null,null,{"$f":"_RB","v":0.34632375765282419},null,"•Quadrilateral shape"]
[null,null,null,null,null,null,null,null,null,null,null,null,null,null,null,null,null,null,null,null,null,null,null,null,"•Second reactance blinder arc†"]
[null,null,null,null,null,null,null,null,null,null,null,null,null,null,null,null,null,"Apparent Loop Impedance",null,null,null,null,null,null,"•FS Line (Only shown for PH-PH faults when"]
[null,null,null,null,null,null,null,null,null,null,null,null,null,null,null,null,null,null,{"$f":"IF(EXACT(_FTYPE,\"SLG\"),\"ZAG\",\"ZBC\")","v":"ZAG"},{"$f":"IMABS(IF(EXACT(_FTYPE,\"SLG\"),_ZAG,_ZBC))","v":2.3173012314964367},null,{"$f":"DEGREES(IMARGUMENT(IF(EXACT(_FTYPE,\"SLG\"),_ZAG,_ZBC)))","v":71.536413232257644},null,null,"  Z1ANG>70°)"]
[null,null,null,null,null,null,null,null,null,null,null,null,null,null,null,null,null,null,null,null,null,null,null,null,"  †Not always shown/applicable."]
[]
[]
[null,null,null,null,null,null,null,null,null,null,null,null,null,"Test Values",null,null,null,null,null,null,null,"Supervisory Relay\nWord Bits",null,null,"2.  Zoom, pan, and reset with the graph controls"]
[null,null,null,null,null,null,null,null,null,null,null,null,null,"Apply balanced and nominal prefault voltage for 1 second."]
[null,null,null,null,null,null,null,null,null,null,null,null,null,"Ensure breaker poles closed.",null,null,null,null,null,null,null,{"$f":"IF(EXACT(_FTYPE,\"SLG\"),\"ZAGFS\",\"ZBCFS\")","v":"ZAGFS"},{"$f":"IF(_LOOPDIR,\"ASSERTED\",\"DEASSERTED\")","v":"ASSERTED"},null,"3.  Vary the test currents and angles:"]
[null,null,null,null,null,null,null,null,null,null,null,null,null,null,null,null,null,null,null,null,null,{"$f":"IF(EXACT(_FTYPE,\"SLG\"),\"ZGn_50A\",\"ZPn_50BC\")","v":"ZGn_50A"},{"$f":"IF(IF(EXACT(_FTYPE,\"SLG\"),_ZGn_50A,_ZPn_50BC),\"ASSERTED\",\"DEASSERTED\")","v":"ASSERTED"},null,"•Type the desired values     OR"]
[null,null,null,null,null,null,null,null,null,null,null,null,null,"|VA|",20,null,null,"∠VA",0,null,null,{"$f":"IF(EXACT(_FTYPE,\"SLG\"),\"ZGn_50G\",\"\")","v":"ZGn_50G"},{"$f":"IF(ISERROR(IF(IF(EXACT(_FTYPE,\"SLG\"),_ZGn_50G,\"\"),\"ASSERTED\",\"DEASSERTED\")),\"\",IF(IF(EXACT(_FTYPE,\"SLG\"),_ZGn_50G,\"\"),\"ASSERTED\",\"DEASSERTED\"))","v":"ASSERTED"},null,"•Use the increment/decrement arrows"]
[null,null,null,null,null,null,null,null,null,null,null,null,null,"|VB|",{"$f":"_VNOMset/SQRT(3)","v":66.395280956806971},null,null,"∠VB",{"$f":"_VAANG+DEGREES(IMARGUMENT(_a)+IMARGUMENT(_a))-360","v":-120.00000000000003},null,null,null,null,null,"•Modify the incremental change values"]
[null,null,null,null,null,null,null,null,null,null,null,null,null,"|VC|",{"$f":"_VNOMset/SQRT(3)","v":66.395280956806971},null,null,"∠VC",{"$f":"_VAANG+DEGREES(IMARGUMENT(_a))","v":119.99999999999999},null,null,"Also Check:",null,null,"  on each button press as needed."]
[null,null,null,null,null,null,null,null,null,null,null,null,null,null,null,null,null,null,null,null,null,{"$f":"IF(EXACT(_FTYPE,\"SLG\"),\"ZGnTC=1\",\"ZPnTC=1\")","v":"ZGnTC=1"}]
[null,null,null,null,null,null,null,null,null,null,null,null,null,"|IA|",5,null,null,"∠IA",-70,null,null,{"$f":"IF(EXACT(_FTYPE,\"SLG\"),\"ZLOADAG=0\",\"ZLOADBC=0\")","v":"ZLOADAG=0"},null,null,"4.  Verify reactance blinders are satisfied"]
[null,null,null,null,null,null,null,null,null,null,null,null,null,"|IB|",0,null,null,"∠IB",0,null,null,"LOP=0"]
[null,null,null,null,null,null,null,null,null,null,null,null,null,"|IC|",0,null,null,"∠IC",0,null,null,"VPOLOK=1",null,null,"5.  Verify the supervisory bits."]
[null,null,null,null,null,null,null,null,null,null,null,null,null,null,null,null,null,null,null,null,null,{"$f":"IF(EXACT(_FTYPE,\"SLG\"),\"PSBAG=0\",\"PSBBC=0\")","v":"PSBAG=0"}]
[null,null,null,null,null,null,null,null,null,null,null,null,null,"Incremental Change (Buttons)",null,null,null,null,null,null,null,"PSBIP=0"]
[null,null,null,null,null,null,null,null,null,null,null,null,null,null,"𝛥 |I|",0.1,null,"𝛥 ∠I",1,null,null,{"$f":"IF(EXACT(_FTYPE,\"SLG\"),\"OPA=0\",\"OPB=0\")","v":"OPA=0"}]
[null,null,null,null,null,null,null,null,null,null,null,null,null,null,null,null,null,null,null,null,null,{"$f":"IF(EXACT(_FTYPE,\"SLG\"),\"CVTAG=0\",\"OPC=0\")","v":"CVTAG=0"},{"$f":"IF(EXACT(V27,\"CVTAG=0\"),\"Zone 1 only\",\"\")","v":"Zone 1 only"}]
[null,null,null,null,null,null,null,null,null,null,null,null,null,"All angles are provided in degrees",null,null,null,null,null,null,null,{"$f":"IF(EXACT(_FTYPE,\"SLG\"),\"\",\"CVTBC=0\")","v":""},{"$f":"IF(EXACT(V28,\"CVTBC=0\"),\"Zone 1 only\",\"\")","v":""}]

{"sheet":"Info","index":2,"n_rows":10,"n_cols":2,"rows_kept":10,"cut":false,"hidden":false,"merged":[]}
[]
[]
[null,"This spreadsheet contains macros for the following functions:"]
[null,"1. Button functionality (ie. graph navigation, increment/decrement currents/voltages)."]
[null,"2. Auto-populate current/voltage test values depending on the type of fault and phase rotation selected."]
[null,"3. Auto-reset the graph when clicking on the graph worksheet."]
[]
[null,"Macros are not required for this spreadsheet if the user wishes to manually enter test values and adjust the graph zoom limits.  Worksheets can be unprotected under the Review tab.  There is no password."]
[]
[null,"Macro code is available and can be audited under the Developer tab. To enable the developer tab, go to File->Options->Customize Ribbon.  Then select the Developer checkbox under the Main Tabs heading."]

{"sheet":"Calcs","index":3,"n_rows":698,"n_cols":27,"rows_kept":698,"cut":false,"hidden":true,"merged":[]}
[null,"##Definitions"]
[null,"DR",{"$f":"MAX(0.1*_Z1MAGset,0.5)","v":0.5}]
[null,"DX",{"$f":"MAX(0.2*_Z1MAGset,0.5)","v":1}]
[null,"DANG",{"$f":"70","v":70}]
[null,"a",{"$f":"IF(EXACT(_PHROTset,\"ABC\"),COMPLEX(COS(RADIANS(120)),SIN(RADIANS(120))),COMPLEX(COS(RADIANS(-120)),SIN(RADIANS(-120))))","v":"-0.5+0.866025403784439i"}]
[null,"i",{"$f":"COMPLEX(0,1)","v":"i"}]
[null,"ZXTANGLINE",{"$f":"COMPLEX(COS(RADIANS(_ZXnTANGset)),SIN(RADIANS(_ZXnTANGset)))","v":"0.998629534754574-0.0523359562429438i"}]
[null,"ZX1TANGLINE",{"$f":"IF(_ZONE=2,COMPLEX(COS(RADIANS(_ZX1TANGset)),SIN(RADIANS(_ZX1TANGset))),_ZXTANGLINE)","v":"0.998629534754574-0.0523359562429438i"},null,null,"#When using Zone 2 with EPILOT enabled, user must enter Z1 and Z2 TANG settings."]
[null,"ZXTANGCIRC",{"$f":"IF(_ZONE=2,_ZX1TANGset,_ZXnTANGset)","v":-3}]
[]
[null,"##Direction"]
[null,"H",{"$f":"IF(EXACT(_ZDIRnset,\"F\"),1,-1)","v":1}]
[]
[null,"##Test Values (Complex)"]
[null,"VA",{"$f":"COMPLEX(_VAM*COS(RADIANS(_VAANG)),_VAM*SIN(RADIANS(_VAANG)))","v":"20"},null,null,null,"IA",{"$f":"COMPLEX(_IAM*COS(RADIANS(_IAANG)),_IAM*SIN(RADIANS(_IAANG)))","v":"1.71010071662834-4.69846310392954i"}]
[null,"VB",{"$f":"COMPLEX(_VBM*COS(RADIANS(_VBANG)),_VBM*SIN(RADIANS(_VBANG)))","v":"-33.1976404784035-57.5i"},null,null,null,"IB",{"$f":"COMPLEX(_IBM*COS(RADIANS(_IBANG)),_IBM*SIN(RADIANS(_IBANG)))","v":"0"}]
[null,"VC",{"$f":"COMPLEX(_VCM*COS(RADIANS(_VCANG)),_VCM*SIN(RADIANS(_VCANG)))","v":"-33.1976404784035+57.5i"},null,null,null,"IC",{"$f":"COMPLEX(_ICM*COS(RADIANS(_ICANG)),_ICM*SIN(RADIANS(_ICANG)))","v":"0"}]
[]
[null,"VAB",{"$f":"IMSUB(_VA,_VB)","v":"53.1976404784035+57.5i"},null,null,null,"IAB",{"$f":"IMSUB(_IA,_IB)","v":"1.71010071662834-4.69846310392954i"}]
[null,"VBC",{"$f":"IMSUB(_VB,_VC)","v":"-115i"},null,null,null,"IBC",{"$f":"IMSUB(_IB,_IC)","v":"0"}]
[null,"VCA",{"$f":"IMSUB(_VC,_VA)","v":"-53.1976404784035+57.5i"},null,null,null,"ICA",{"$f":"IMSUB(_IC,_IA)","v":"-1.71010071662834+4.69846310392954i"}]
[]
[null,"##Sequence Comps"]
[null,"I1A",{"$f":"IMPRODUCT(1/3,IMSUM(_IA,IMPRODUCT(_a,_IB),IMPRODUCT(_a,_a,_IC)))","v":"0.570033572209447-1.56615436797651i"}]
[null,"I2A",{"$f":"IMPRODUCT(1/3,IMSUM(_IA,IMPRODUCT(_a,_a,_IB),IMPRODUCT(_a,_IC)))","v":"0.570033572209447-1.56615436797651i"}]
[null,"I2B",{"$f":"IMPRODUCT(_I2A,_a)","v":"1.0713126828109+1.27674073853163i"}]
[null,"I2C",{"$f":"IMPRODUCT(_I2A,_a,_a)","v":"-1.64134625502034+0.289413629444884i"}]
[null,"I0",{"$f":"IMPRODUCT(1/3,IMSUM(_IA,_IB,_IC))","v":"0.570033572209447-1.56615436797651i"}]
[null,"IR",{"$f":"IMSUM(_IA,_IB,_IC)","v":"1.71010071662834-4.69846310392954i"}]
[null,"V1POLA",{"$f":"COMPLEX(_VNOMset/SQRT(3),0)","v":"66.395280956807"}]
[null,"V1POLB",{"$f":"IMPRODUCT(_V1POLA,_a,_a)","v":"-33.1976404784035-57.5000000000001i"}]
[null,"V1POLC",{"$f":"IMPRODUCT(_V1POLA,_a)","v":"-33.1976404784035+57.5000000000001i"}]
[null,"V1POLBC",{"$f":"IMSUB(_V1POLB,_V1POLC)","v":"-115i"}]
[]
[null,"##Misc"]
[null,"Z",{"$f":"COMPLEX(COS(RADIANS(_Z1ANGset)),SIN(RADIANS(_Z1ANGset)))","v":"0.17364817766693+0.984807753012208i"}]
[null,"k0",{"$f":"COMPLEX(_k0Mnset*COS(RADIANS(_k0Anset)),_k0Mnset*SIN(RADIANS(_k0Anset)))","v":"0.72552531928516-0.0462818655216826i"}]
[null,"ZXn",{"$f":"COMPLEX(_ZXnset*COS(RADIANS(_Z1ANGset)),_ZXnset*SIN(RADIANS(_Z1ANGset)))","v":"0.520944533000791+2.95442325903662i"}]
[]
[null,"###############################AG FAULT#####################################",null,null,null,null,null,null,null,"###############################BC/ABC FAULT#####################################"]
[null,"IAG",{"$f":"IMSUM(_IA,IMPRODUCT(_k0,_IR))","v":"2.73336844753524-8.18646369895309i"}]
[]
[null,"ZAG",{"$f":"IMDIV(_VA,_IAG)","v":"0.733893710952269+2.19801842997724i"},null,null,null,null,null,null,"ZBC",{"$f":"IMDIV(IMSUB(_VB,_VC),IMSUB(_IB,_IC))","v":{"$error":"#NUM!"}}]
[]
[]
[null,"XAG1",{"$f":"IMAGINARY(IMPRODUCT(_VA,IMCONJUGATE(IMPRODUCT(_ZXTANGLINE,_IAG))))/IMAGINARY(IMPRODUCT(_IAG,_Z,IMCONJUGATE(IMPRODUCT(_ZXTANGLINE,_IAG))))","v":2.2501877092165845},null,null,null,null,null,null,"XBC1",{"$f":"IMAGINARY(IMPRODUCT(_VBC,IMCONJUGATE(IMPRODUCT(_ZXTANGLINE,_IBC))))/IMAGINARY(IMPRODUCT(_IBC,_Z,IMCONJUGATE(IMPRODUCT(_ZXTANGLINE,_IBC))))","v":{"$error":"#DIV/0!"}}]
[null,"XAG2",{"$f":"IMAGINARY(IMPRODUCT(_VA,IMCONJUGATE(IMPRODUCT(_IPOL2,_IAG))))/IMAGINARY(IMPRODUCT(_IAG,_Z,IMCONJUGATE(IMPRODUCT(_IPOL2,_IAG))))","v":2.2479848197449313},null,null,null,null,null,null,"XBC2",{"$f":"IMAGINARY(IMPRODUCT(_VBC,IMCONJUGATE(IMPRODUCT(_IPOL2,_IBC))))/IMAGINARY(IMPRODUCT(_IBC,_Z,IMCONJUGATE(IMPRODUCT(_IPOL2,_IBC))))","v":{"$error":"#DIV/0!"}}]
[null,"RAGB",{"$f":"IMAGINARY(IMPRODUCT(_Z,_IAG, IMCONJUGATE(_VA)))/(IMPRODUCT(IMAGINARY(_Z),IMABS(_IAG),IMABS(_IAG)))","v":0.34632375765282419},null,null,null,null,null,null,"RBCB",{"$f":"IMAGINARY(IMPRODUCT(_Z,_IBC, IMCONJUGATE(_VBC)))/(IMPRODUCT(IMAGINARY(_Z),IMABS(_IBC),IMABS(_IBC)))","v":{"$error":"#DIV/0!"}}]
[null,null,null,null,"X1",{"$f":"IF(EXACT(_FTYPE,\"SLG\"),C46,K46)","v":2.2501877092165845}]
[null,null,null,null,"X2",{"$f":"IF(EXACT(_FTYPE,\"SLG\"),C47,K47)","v":2.2479848197449313}]
[null,null,null,null,"RB",{"$f":"IF(EXACT(_FTYPE,\"SLG\"),C48,K48)","v":0.34632375765282419}]
[]
[null,"IPOL2AG",{"$f":"IMDIV(IMSUB(IMPRODUCT(3,IMSUM(_I2A,_I0),_ZX1TANGLINE),IMPRODUCT(_i,_K,_V1POLA)),_IAG)","v":"1.24069830794316-0.0571148395459992i"},null,null,null,null,null,null,"IPOL2BC",{"$f":"IMDIV(IMSUB(IMPRODUCT(3,IMSUB(_I2B,_I2C),_ZX1TANGLINE),IMPRODUCT(_i,_K/SQRT(3),_V1POLBC)),_IBC)","v":{"$error":"#NUM!"}}]
[]
[null,null,null,null,null,null,"IPOL2",{"$f":"IF(EXACT(_FTYPE,\"SLG\"),Calcs!C53,Calcs!K53)","v":"1.24069830794316-0.0571148395459992i"},null,null,null,"#2nd Reactance Line  Choose AG or BC Depending on FTYPE"]
[]
[null,"####################DIRECTIONAL SUPERVISION BITS#########################"]
[null,"FSSOPA",{"$f":"_I2A","v":"0.570033572209447-1.56615436797651i"},null,"FSPOLA","FSPOLA",{"$f":"_I0","v":"0.570033572209447-1.56615436797651i"},null,null,null,"THETA (Deg)",30]
[null,"FSSOPB",{"$f":"_I2B","v":"1.0713126828109+1.27674073853163i"},null,"FSPOLBC","FSPOLB",{"$f":"_I0","v":"0.570033572209447-1.56615436797651i"}]
[null,"FSSOPC",{"$f":"_I2C","v":"-1.64134625502034+0.289413629444884i"},null,null,"FSPOLC",{"$f":"_I0","v":"0.570033572209447-1.56615436797651i"}]
[]
[null,"FSSOPBC",{"$f":"IMPRODUCT(IMPRODUCT(-1,_Z),COMPLEX(_H,0),_I2A)","v":"-1.64134625502034-0.289413629444884i"},null,null,"FSPOLBC",{"$f":"_V1POLA","v":"66.395280956807"},null,null,null,"THETA (Deg)",90]
[]
[null,"ZAGFS",{"$f":"AND((IMREAL(IMPRODUCT(_FSSOPA,IMCONJUGATE(_FSPOLA))))>(IMABS(_FSSOPA)*IMABS(_FSPOLA)*COS(RADIANS($L$58))),_50SUPV_I2_G,_50SUPV_I0,_50SUPV_I2I1_G,_50SUPV_I0I1)","v":true}]
[null,"ZBGFS",{"$f":"AND((IMREAL(IMPRODUCT(_FSSOPB,IMCONJUGATE(_FSPOLB))))>(IMABS(_FSSOPB)*IMABS(_FSPOLB)*COS(RADIANS($L$58))),_50SUPV_I2_G,_50SUPV_I0,_50SUPV_I2I1_G,_50SUPV_I0I1)","v":false}]
[null,"ZCGFS",{"$f":"AND((IMREAL(IMPRODUCT(_FSSOPC,IMCONJUGATE(_FSPOLC))))>(IMABS(_FSSOPC)*IMABS(_FSPOLC)*COS(RADIANS($L$58))),_50SUPV_I2_G,_50SUPV_I0,_50SUPV_I2I1_G,_50SUPV_I0I1)","v":false},null,"Final Loop Selection",{"$f":"IF(EXACT(_FTYPE,\"SLG\"),_ZAGFS,_ZBCnFS)","v":true}]
[null,"ZBCFLT",{"$f":"(IMREAL(IMPRODUCT(_FSSOPBC,IMCONJUGATE(_FSPOLBC))))>(IMABS(_FSSOPBC)*IMABS(_FSPOLBC)*COS(RADIANS($L$62)))","v":false}]
[null,"ZBCnFS",{"$f":"OR(AND(OR(_ZBCFLT,EXACT(_ZONE,\"5\")),NOT(OR(_ZBGFS,_ZCGFS)),_50SUPV_I2_P),NOT(_50SUPV_I2I1_P))","v":false}]
[]
[null,"####################OC SUPERVISION BITS#########################"]
[]
[null,"ZGn_50A",{"$f":"IMABS(_IA)>_ZGn_50Pset","v":true},null,"50SUPV_I2_G",{"$f":"3*IMABS(_I2A)>(0.05*_INOMset)","v":true},"#I2 CHECK"]
[null,"ZGn_50G",{"$f":"(3*IMABS(_I0))>_ZGn_50Gset","v":true},null,"50SUPV_I2_P",{"$f":"3*IMABS(_I2A)>(3*0.05*_INOMset)","v":true},"#I2 CHECK"]
[null,"ZPn_50BC",{"$f":"IMABS(_IBC)>_ZPn_50PPset","v":false},null,"50SUPV_I0",{"$f":"3*IMABS(_I0)>(0.05*_INOMset)","v":true},"#I0 CHECK"]
[null,null,null,null,"50SUPV_I2I1_G",{"$f":"IMABS(_I2A)>(0.1*IMABS(_I1A))","v":true},"#I2/I1 RATIO CHECK"]
[null,null,null,null,"50SUPV_I2I1_P",{"$f":"IMABS(_I2A)>(0.15*IMABS(_I1A))","v":true},"#I2/I1 RATIO CHECK"]
[null,null,null,null,"50SUPV_I0I1",{"$f":"IMABS(_I0)>(0.1*IMABS(_I1A))","v":true},"#I0/I1 RATIO CHECK"]
[]
[]
[null,"########################################################PLOTTING################################################################################################################PLOTTING################################################################################################################PLOTTING########################################################"]
[null,null,null,"##ZXn Point"]
[null,null,null,null,"X","Y"]
[null,null,null,"Origin",0,0]
[null,null,null,"ZGn",{"$f":"IF(EXACT(_FTYPE,\"SLG\"),IMREAL(_ZAG),IMREAL(_ZBC))","v":0.73389371095226896},{"$f":"IF(EXACT(_FTYPE,\"SLG\"),IMAGINARY(_ZAG),IMAGINARY(_ZBC))","v":2.1980184299772398}]
[null,null,null,null,null,null,null,null,null,null,null,null,null,null,null,null,null,null,null,null,null,null,"#################################ZONE 5####################################"]
[null,"########################################################################################ZONES 1-4########################################################################################",null,null,null,null,null,null,null,null,null,null,null,null,null,null,null,null,null,null,null,null,null,null,"b5bottom",{"$f":"_ZX5REVset*SIN(RADIANS(_Z1ANGset))-TAN(RADIANS(_ZXnTANGset))*_ZX5REVset*COS(RADIANS(_Z1ANGset))","v":3.9756330735211152},"#*magnitude* of y-int Zone 5 bottom reactance"]
[null,"K",{"$f":"0.15*SQRT(3)*_INOMset/_VNOMset","v":1.1295983527623111E-2}]
[null,"bSELF",{"$f":"_ZXnset*SIN(RADIANS(_Z1ANGset))-TAN(RADIANS(_ZXnTANGset))*_ZXnset*COS(RADIANS(_Z1ANGset))","v":2.9817248051408365},"#y-int self-polarized reactance",null,null,null,null,null,null,null,"b2",{"$f":"_ZXnset*SIN(RADIANS(_Z1ANGset))-TAN(IMARGUMENT(_IPOL2))*_ZXnset*COS(RADIANS(_Z1ANGset))","v":2.9784046437328211},"#y-int 2nd Reactance Line",null,null,null,null,null,null,null,null,null,null,"#Zone 5 Characteristic"]
[null,null,null,null,null,null,null,null,null,null,null,null,null,null,null,null,null,null,null,null,null,null,null,null,null,"X","Y"]
[null,null,null,"#Base Forward Quad Coordinates. No DR/DX Applied.",null,null,null,null,null,null,null,"#Base Reactance With 2nd Reactance Line: Z1 (always) & Z2 when EPILOT=POTT",null,null,null,null,null,null,null,null,null,null,null,null,"TOPLEFT",{"$f":"-_ZXnRset","v":-10},{"$f":"-_ZXnRset*TAN(RADIANS(_ZXnTANGset))+_bSELF","v":3.5058025979712486}]
[null,null,null,null,"X","Y",null,null,null,null,null,null,"X","Y",null,null,null,null,null,null,null,null,null,null,"MIDLEFT",{"$f":"IF(OR(AA90<0,AA92>0),Z90,-_ZXnRset)","v":-10},{"$f":"IF(OR(AA90<0,AA92>0),AA90,0)","v":0}]
[null,null,null,"TOPLEFT",{"$f":"(_bSELF-TAN(RADIANS(_Z1ANGset))*_ZXnRset)/(TAN(RADIANS(_Z1ANGset))-TAN(RADIANS(_ZXnTANGset)))","v":-9.3874925365197051},{"$f":"(E92+_ZXnRset)*TAN(RADIANS(_Z1ANGset))","v":3.473702442015953},null,null,null,null,null,"BOTTOMLEFT",{"$f":"IF(OR(AND(_H=1,_ZONE=1,ISNUMBER(M93)),AND(_H=1,_ZONE=2,_EPILOTset<>\"N\",ISNUMBER(M93))),E93,NA())","v":-9.3969262078590834},{"$f":"IF(OR(AND(_H=1,_ZONE=1,ISNUMBER(M93)),AND(_H=1,_ZONE=2,_EPILOTset<>\"N\",ISNUMBER(M93))),F93,NA())","v":3.420201433256687},null,null,null,null,null,null,null,null,null,null,"BOTTOMLEFT",{"$f":"-(_b5bottom+TAN(RADIANS(_Z1ANGset))*_ZXnRset)/(TAN(RADIANS(_Z1ANGset))-TAN(RADIANS(_ZXnTANGset)))","v":-10.603029780188217},{"$f":"-TAN(RADIANS(_Z1ANGset))*(-_ZXnRset+(_b5bottom+TAN(RADIANS(_Z1ANGset))*_ZXnRset)/(TAN(RADIANS(_Z1ANGset))-TAN(RADIANS(_ZXnTANGset))))","v":-3.419951829069499}]
[null,null,null,"BOTTOMLEFT",{"$f":"-E96","v":-9.3969262078590834},{"$f":"-F96","v":3.420201433256687},null,null,null,null,null,"TOPLEFT",{"$f":"IF(OR(AND(_H=1,_ZONE=1),AND(_H=1,_ZONE=2,_EPILOTset<>\"N\")),(_b2-TAN(RADIANS(_Z1ANGset))*_ZXnRset)/(TAN(RADIANS(_Z1ANGset))-TAN(IMARGUMENT(_IPOL2))),NA())","v":-9.3985379162807092},{"$f":"IF(OR(AND(_H=1,_ZONE=1),AND(_H=1,_ZONE=2,_EPILOTset<>\"N\")),(M93+_ZXnRset)*TAN(RADIANS(_Z1ANGset)),NA())","v":3.4110609805865968},null,null,null,null,null,null,null,null,null,null,"BOTTOMRIGHT",{"$f":"_ZXnRset","v":10},{"$f":"TAN(RADIANS(_ZXnTANGset))*_ZXnRset-_b5bottom","v":-4.4997108663515277}]
[null,null,null,"MIDLEFT",0,0,null,null,null,null,null,"TOPRIGHT",{"$f":"IF(OR(AND(_H=1,_ZONE=1),AND(_H=1,_ZONE=2,_EPILOTset<>\"N\")),(_b2+TAN(RADIANS(_Z1ANGset))*_ZXnRset)/(TAN(RADIANS(_Z1ANGset))-TAN(IMARGUMENT(_IPOL2))),NA())","v":10.440426982282293},{"$f":"IF(OR(AND(_H=1,_ZONE=1),AND(_H=1,_ZONE=2,_EPILOTset<>\"N\")),(M94-_ZXnRset)*TAN(RADIANS(_Z1ANGset)),NA())","v":2.4977855374866595},null,null,null,null,null,null,null,null,null,null,"MIDRIGHT",{"$f":"IF(OR(AA93>0,AA95<0),Z93,_ZXnRset)","v":10},{"$f":"IF(OR(AA93>0,AA95<0),AA93,0)","v":0}]
[null,null,null,"MIDBOTTOM",0,0,null,null,null,null,null,"BOTTOMRIGHT",{"$f":"IF(OR(AND(_H=1,_ZONE=1,ISNUMBER(M93)),AND(_H=1,_ZONE=2,_EPILOTset<>\"N\",ISNUMBER(M93))),E96,NA())","v":9.3969262078590834},{"$f":"IF(OR(AND(_H=1,_ZONE=1,ISNUMBER(M93)),AND(_H=1,_ZONE=2,_EPILOTset<>\"N\",ISNUMBER(M93))),F96,NA())","v":-3.420201433256687},null,null,null,null,null,null,null,null,null,null,"TOPRIGHT",{"$f":"(_bSELF+TAN(RADIANS(_Z1ANGset))*_ZXnRset)/(TAN(RADIANS(_Z1ANGset))-TAN(RADIANS(_ZXnTANGset)))","v":10.429381602521287},{"$f":"TAN(RADIANS(_Z1ANGset))*(-_ZXnRset+(_bSELF+TAN(RADIANS(_Z1ANGset))*_ZXnRset)/(TAN(RADIANS(_Z1ANGset))-TAN(RADIANS(_ZXnTANGset))))","v":2.4351440760572931}]
[null,null,null,"BOTTOMRIGHT",{"$f":"-_ZXnRset*TAN(RADIANS(_Z1ANGset))/(TAN(RADIANS(_DANG-90))-TAN(RADIANS(_Z1ANGset)))","v":9.3969262078590834},{"$f":"-TAN(RADIANS(_DANG-90))*_ZXnRset*TAN(RADIANS(_Z1ANGset))/(TAN(RADIANS(_DANG-90))-TAN(RADIANS(_Z1ANGset)))","v":-3.420201433256687},null,null,null,null,null,null,null,null,null,null,null,null,null,null,null,null,null,null,"TOPLEFT",{"$f":"-_ZXnRset","v":-10},{"$f":"-_ZXnRset*TAN(RADIANS(_ZXnTANGset))+_bSELF","v":3.5058025979712486}]
[null,null,null,"TOPRIGHT",{"$f":"(_bSELF+TAN(RADIANS(_Z1ANGset))*_ZXnRset)/(TAN(RADIANS(_Z1ANGset))-TAN(RADIANS(_ZXnTANGset)))","v":10.429381602521287},{"$f":"(E97-_ZXnRset)*TAN(RADIANS(_Z1ANGset))","v":2.4351440760572931}]
[null,null,null,"TOPLEFT",{"$f":"E92","v":-9.3874925365197051},{"$f":"F92","v":3.473702442015953},"#Repeat 1st coordinate to close the loop",null,null,null,null,null,null,null,null,null,null,null,null,null,null,null,null,null,"#Find and correct scenarios: top left corner is below the horizontal (follow line angle); similar for bottom right corner. If top right corner is below horizontal (follow veritcal line at resistive reach); similar for bottom left corner."]
[null,null,null,null,null,null,null,null,null,null,null,null,null,null,null,null,null,null,null,null,null,null,null,null,null,"X","Y"]
[null,null,null,"#Find and correct scenario where reactance line and bottom of quad overlap",null,null,null,null,null,null,null,null,null,null,null,null,null,null,null,null,null,null,null,null,"TOPLEFT",{"$f":"IF(AA90<0,(_bSELF-TAN(RADIANS(_Z1ANGset))*_ZXnRset)/(TAN(RADIANS(_Z1ANGset))-TAN(RADIANS(_ZXnTANGset))),Z90)","v":-10},{"$f":"IF(AA90<0,(Z100+_ZXnRset)*TAN(RADIANS(_Z1ANGset)),AA90)","v":3.5058025979712486}]
[null,null,null,null,"X","Y",null,null,null,null,null,null,null,null,null,null,null,null,null,null,null,null,null,null,"MIDLEFT",{"$f":"IF(OR(AA100<0,AA102>0),Z100,-_ZXnRset)","v":-10},{"$f":"IF(OR(AA100<0,AA102>0),AA100,0)","v":0}]
[null,null,null,"TOPLEFT",{"$f":"IF(F92<F93,-_bSELF/(TAN(RADIANS(_ZXnTANGset))+TAN(RADIANS(90-_DANG))),E92)","v":-9.3874925365197051},{"$f":"IF(F92<F93,TAN(RADIANS(90-_DANG))*_bSELF/(TAN(RADIANS(_ZXnTANGset))+TAN(RADIANS(90-_DANG))),F92)","v":3.473702442015953},null,null,null,null,null,null,null,null,null,null,null,null,null,null,null,null,null,null,"BOTTOMLEFT",{"$f":"IF(AA92>0,-_ZXnRset,Z92)","v":-10.603029780188217},{"$f":"IF(AA92>0,TAN(RADIANS(_ZXnTANGset))*(-_ZXnRset)-_b5bottom,AA92)","v":-3.419951829069499}]
[null,null,null,"BOTTOMLEFT",{"$f":"IF(F92<F93,E102,E93)","v":-9.3969262078590834},{"$f":"IF(F92<F93,F102,F93)","v":3.420201433256687},null,null,null,null,null,null,null,null,null,null,null,null,null,null,null,null,null,null,"BOTTOMRIGHT",{"$f":"IF(AA93>0,(-_b5bottom+TAN(RADIANS(_Z1ANGset))*_ZXnRset)/(TAN(RADIANS(_Z1ANGset))-TAN(RADIANS(_ZXnTANGset))),Z93)","v":10},{"$f":"IF(AA93>0,(Z103-_ZXnRset)*TAN(RADIANS(_Z1ANGset)),AA93)","v":-4.4997108663515277}]
[null,null,null,"MIDLEFT",{"$f":"E94","v":0},{"$f":"F94","v":0},null,null,null,null,null,null,null,null,null,null,null,null,null,null,null,null,null,null,"MIDRIGHT",{"$f":"IF(OR(AA103>0,AA105<0),Z103,_ZXnRset)","v":10},{"$f":"IF(OR(AA103>0,AA105<0),AA103,0)","v":0}]
[null,null,null,"MIDBOTTOM",{"$f":"E95","v":0},0,null,null,null,null,null,null,null,null,null,null,null,null,null,null,null,null,null,null,"TOPRIGHT",{"$f":"IF(AA95<0,_ZXnRset,Z95)","v":10.429381602521287},{"$f":"IF(AA95<0,TAN(RADIANS(_ZXnTANGset))*_ZXnRset+_bSELF,AA95)","v":2.4351440760572931}]
[null,null,null,"BOTTOMRIGHT",{"$f":"IF(F97<F96,-_bSELF/(TAN(RADIANS(_ZXnTANGset))+TAN(RADIANS(90-_DANG))),E96)","v":9.3969262078590834},{"$f":"IF(F97<F96,TAN(RADIANS(90-_DANG))*_bSELF/(TAN(RADIANS(_ZXnTANGset))+TAN(RADIANS(90-_DANG))),F96)","v":-3.420201433256687},null,null,null,null,null,null,null,null,null,null,null,null,null,null,null,null,null,null,"TOPLEFT",{"$f":"Z100","v":-10},{"$f":"AA100","v":3.5058025979712486}]
[null,null,null,"TOPRIGHT",{"$f":"IF(F97<F96,E106,E97)","v":10.429381602521287},{"$f":"IF(F97<F96,F106,F97)","v":2.4351440760572931}]
[null,null,null,"TOPLEFT",{"$f":"E102","v":-9.3874925365197051},{"$f":"F102","v":3.473702442015953}]
[]
[null,null,null,"#Applying DR/DX for F",null,null,null,null,null,null,null,"#Apply DR/DX on 2nd reactance line"]
[null,null,null,null,"X","Y",null,null,null,null,null,null,"X","Y"]
[null,null,null,"TOPLEFT",{"$f":"IF(E92<-_DR,-_DR,E92)","v":-0.5},{"$f":"IF(E92<-_DR,TAN(RADIANS(_ZXnTANGset))*(-_DR)+_bSELF,F92)","v":3.0079286947823571},null,null,null,null,null,"BOTTOMLEFT",{"$f":"IF(M92<-_DR,-_DR,M92)","v":-0.5},{"$f":"IF(M92<-_DR,TAN(RADIANS(_DANG-90))*(-_DR),N92)","v":0.18198511713310117}]
[null,null,null,"BOTTOMLEFT",{"$f":"IF(E93<-_DR,E114,E93)","v":-0.5},{"$f":"IF(E93<-_DR,F114,F93)","v":0.18198511713310117},null,null,null,null,null,"TOPLEFT",{"$f":"IF(M93<-_DR,-_DR,M93)","v":-0.5},{"$f":"IF(M93<-_DR,TAN(IMARGUMENT(_IPOL2))*(-_DR)+_b2,N93)","v":3.0014218587883832}]
[null,null,null,"MIDLEFT",{"$f":"IF(E93<-_DR,-_DR,E94)","v":-0.5},{"$f":"IF(E93<-_DR,TAN(RADIANS(_DANG-90))*(-_DR),F94)","v":0.18198511713310117},null,null,null,null,null,"TOPRIGHT",{"$f":"M94","v":10.440426982282293},{"$f":"N94","v":2.4977855374866595}]
[null,null,null,"MIDBOTTOM",{"$f":"IF(F96<-_DX,-_DX/(TAN(RADIANS(_DANG-90))),E95)","v":2.7474774194546225},{"$f":"IF(F96<-_DX,-_DX,F95)","v":-1},null,null,null,null,null,"BOTTOMRIGHT",{"$f":"IF(N95<-_DX,_ZXnRset-_DX/TAN(RADIANS(_Z1ANGset)),M95)","v":9.8236730192915349},{"$f":"IF(N95<-_DX,-_DX,N95)","v":-1}]
[null,null,null,"BOTTOMRIGHT",{"$f":"IF(F96<-_DX,_ZXnRset-_DX/TAN(RADIANS(_Z1ANGset)),E96)","v":9.8236730192915349},{"$f":"IF(F96<-_DX,-_DX,F96)","v":-1}]
[null,null,null,"TOPRIGHT",{"$f":"E97","v":10.429381602521287},{"$f":"F97","v":2.4351440760572931}]
[null,null,null,"TOPLEFT",{"$f":"E112","v":-0.5},{"$f":"F112","v":3.0079286947823571}]
[]
[null,null,null,"#Find and correct scenario where reactance line is below DX line for forward zones"]
[null,null,null,null,"X","Y"]
[null,null,null,"TOPLEFT",{"$f":"E112","v":-0.5},{"$f":"F112","v":3.0079286947823571}]
[null,null,null,"BOTTOMLEFT",{"$f":"E113","v":-0.5},0.18198511713310117]
[null,null,null,"MIDLEFT",{"$f":"E114","v":-0.5},0.18198511713310117]
[null,null,null,"MIDBOTTOM",{"$f":"E115","v":2.7474774194546225},-1]
[null,null,null,"BOTTOMRIGHT",{"$f":"IF(F117<F116,(-_DX-_bSELF)/TAN(RADIANS(_ZXnTANGset)),E116)","v":9.8236730192915349},{"$f":"IF(F117<F116,-_DX,F116)","v":-1}]
[null,null,null,"TOPRIGHT",{"$f":"IF(F117<F116,E126,E117)","v":10.429381602521287},{"$f":"IF(F117<F116,F126,F117)","v":2.4351440760572931}]
[null,null,null,"TOPLEFT",{"$f":"E118","v":-0.5},3.0079286947823571]
[]
[null,null,null,"#Reverse Quad"]
[null,null,null,null,"X","Y"]
[null,null,null,"TOPLEFT",{"$f":"-E102","v":9.3874925365197051},-3.473702442015953]
[null,null,null,"BOTTOMLEFT",9.3969262078590834,-3.420201433256687]
[null,null,null,"MIDLEFT",0,0]
[null,null,null,"MIDBOTTOM",0,0]
[null,null,null,"BOTTOMRIGHT",-9.3969262078590834,3.420201433256687]
[null,null,null,"TOPRIGHT",-10.429381602521287,-2.4351440760572931]
[null,null,null,"TOPLEFT",9.3874925365197051,-3.473702442015953]
[]
[null,null,null,"#Final Plot Based on Direction"]
[null,null,null,null,"X","Y"]
[null,null,null,"TOPLEFT",{"$f":"IF(_H=1,E122,E132)","v":-0.5},3.0079286947823571]
[null,null,null,"BOTTOMLEFT",-0.5,0.18198511713310117]
[null,null,null,"MIDLEFT",-0.5,0.18198511713310117]
[null,null,null,"MIDBOTTOM",2.7474774194546225,-1]
[null,null,null,"BOTTOMRIGHT",9.8236730192915349,-1]
[null,null,null,"TOPRIGHT",10.429381602521287,2.4351440760572931]
[null,null,null,"TOPLEFT",-0.5,3.0079286947823571]
[]
[null,null,null,"|PlotMax|",{"$f":"MAX(ABS(F155:G161))","v":10.429381602521287}]
[]
[null,"###################################################Combine Zones###########################################################"]
[]
[null,null,null,"Zones 1-4","Zone 5","X","Y"]
[null,null,null,"TOPLEFT","TOPLEFT",{"$f":"IF(_ZONE=5,Calcs!Z100,Calcs!E142)","v":-0.5},{"$f":"IF(_ZONE=5,Calcs!AA100,Calcs!F142)","v":3.0079286947823571}]
[null,null,null,"BOTTOMLEFT","MIDLEFT",{"$f":"IF(_ZONE=5,Calcs!Z101,Calcs!E143)","v":-0.5},{"$f":"IF(_ZONE=5,Calcs!AA101,Calcs!F143)","v":0.18198511713310117}]
[null,null,null,"MIDLEFT","BOTTOMLEFT",{"$f":"IF(_ZONE=5,Calcs!Z102,Calcs!E144)","v":-0.5},{"$f":"IF(_ZONE=5,Calcs!AA102,Calcs!F144)","v":0.18198511713310117}]
[null,null,null,"MIDBOTTOM","BOTTOMRIGHT",{"$f":"IF(_ZONE=5,Calcs!Z103,Calcs!E145)","v":2.7474774194546225},{"$f":"IF(_ZONE=5,Calcs!AA103,Calcs!F145)","v":-1}]
[null,null,null,"BOTTOMRIGHT","MIDRIGHT",{"$f":"IF(_ZONE=5,Calcs!Z104,Calcs!E146)","v":9.8236730192915349},{"$f":"IF(_ZONE=5,Calcs!AA104,Calcs!F146)","v":-1}]
[null,null,null,"TOPRIGHT","TOPRIGHT",{"$f":"IF(_ZONE=5,Calcs!Z105,Calcs!E147)","v":10.429381602521287},{"$f":"IF(_ZONE=5,Calcs!AA105,Calcs!F147)","v":2.4351440760572931}]
[null,null,null,"TOPLEFT","TOPLEFT",{"$f":"IF(_ZONE=5,Calcs!Z106,Calcs!E148)","v":-0.5},{"$f":"IF(_ZONE=5,Calcs!AA106,Calcs!F148)","v":3.0079286947823571}]
[]
[]
[]
[null,"##Line Angle",null,null,null,"##FS Line"]
[null,"X","Y",null,null,"X","Y"]
[null,{"$f":"100*COS(RADIANS(_Z1ANGset))","v":17.36481776669304},{"$f":"100*SIN(RADIANS(_Z1ANGset))","v":98.480775301220802},null,null,{"$f":"IF(AND(AND(EXACT(_FTYPE,\"PH-PH\"),NOT(EXACT(_ZONE,\"5\"))),_Z1ANGset>70),100,NA())","v":{"$error":"#N/A"}},{"$f":"TAN(RADIANS(_Z1ANGset-90))*F167","v":{"$error":"#N/A"}}]
[null,0,0,null,null,{"$f":"IF(AND(AND(EXACT(_FTYPE,\"PH-PH\"),NOT(EXACT(_ZONE,\"5\"))),_Z1ANGset>70),0,NA())","v":{"$error":"#N/A"}},{"$f":"TAN(RADIANS(_Z1ANGset-90))*F168","v":{"$error":"#N/A"}}]
[null,{"$f":"-B167","v":-17.36481776669304},{"$f":"-C167","v":-98.480775301220802},null,null,{"$f":"IF(AND(AND(EXACT(_FTYPE,\"PH-PH\"),NOT(EXACT(_ZONE,\"5\"))),_Z1ANGset>70),-100,NA())","v":{"$error":"#N/A"}},{"$f":"TAN(RADIANS(_Z1ANGset-90))*F169","v":{"$error":"#N/A"}}]
[]
[]
[]
[]
[null,"##Reactance Bend Trajectory"]
[]
[null,"AG",null,null,null,null,null,"BC",null,null,null,null,null,"3PH"]
[]
[null,"ZBOTTAG",{"$f":"IMDIV(COMPLEX(0,-_VAM),IMPRODUCT(0.75*_INOMset/(2*5),IMSUM(1,_k0),COMPLEX(COS(RADIANS(-_ZXTANGCIRC)),SIN(RADIANS(-_ZXTANGCIRC)))))","v":"-0.78916867694107-30.8872697818406i"},null,null,null,null,"ZBOTTBC",{"$f":"IMDIV(IF(EXACT(_PHROTset,\"ABC\"),_VBC,IMSUB(_VC,_VB)),COMPLEX((0.5*_INOMset/5)*COS(RADIANS(-_ZXTANGCIRC)),(0.5*_INOMset/5)*SIN(RADIANS(-_ZXTANGCIRC))))","v":"-12.0372699358771-229.684792993552i"},null,null,null,null,"ZBOTT3PH",{"$f":"COMPLEX(0,0)","v":"0"}]
[]
[null,"#Rectangular Coordinates",null,null,null,null,null,"#Rectangular Coordinates",null,null,null,null,null,"#Rectangular Coordinates"]
[null,null,"X","Y",null,null,null,null,"X","Y",null,null,null,null,"X","Y"]
[null,"ZBOTTAG",{"$f":"IMREAL(_ZBOTTAG)","v":-0.78916867694106996},{"$f":"IMAGINARY(_ZBOTTAG)","v":-30.887269781840601},null,null,null,"ZBOTTBC",{"$f":"IMREAL(_ZBOTTBC)","v":-12.0372699358771},{"$f":"IMAGINARY(_ZBOTTBC)","v":-229.68479299355201},null,null,null,"ZBOTT3PH",{"$f":"IMREAL(_ZBOTT3PH)","v":0},{"$f":"IMAGINARY(_ZBOTT3PH)","v":0}]
[null,"ZXn",{"$f":"IMREAL(_ZXn)","v":0.52094453300079102},{"$f":"IMAGINARY(_ZXn)","v":2.95442325903662},null,null,null,"ZXn",{"$f":"IMREAL(_ZXn)","v":0.52094453300079102},{"$f":"IMAGINARY(_ZXn)","v":2.95442325903662},null,null,null,"ZXn",{"$f":"IMREAL(_ZXn)","v":0.52094453300079102},{"$f":"IMAGINARY(_ZXn)","v":2.95442325903662}]
[null,"ZMIDAG",{"$f":"(C183-C182)/2+C182","v":-0.13411207197013941},{"$f":"(D183-D182)/2+D182","v":-13.966423261401992},null,null,null,"ZMIDBC",{"$f":"(I183-I182)/2+I182","v":-5.7581627014381551},{"$f":"(J183-J182)/2+J182","v":-113.3651848672577},null,null,null,"ZMID3PH",{"$f":"(O183-O182)/2+O182","v":0.26047226650039551},{"$f":"(P183-P182)/2+P182","v":1.47721162951831}]
[]
[null,"ZRADAG",{"$f":"SQRT((C183-C184)^2+(D183-D184)^2)","v":16.933521374007107},null,null,null,null,"ZRADBC",{"$f":"SQRT((I183-I184)^2+(J183-J184)^2)","v":116.48896266306203},null,null,null,null,"ZRAD3PH",{"$f":"SQRT((O183-O184)^2+(P183-P184)^2)","v":1.499999999999998}]
[]
[]
[null,"#Circle Center"]
[null,"h","k"]
[null,{"$f":"_xlfn.IFS(EXACT(_FTYPE,\"SLG\"),C184,EXACT(_FTYPE,\"PH-PH\"),I184,EXACT(_FTYPE,\"3PH\"),O184)","v":-0.13411207197013941},{"$f":"_xlfn.IFS(EXACT(_FTYPE,\"SLG\"),D184,EXACT(_FTYPE,\"PH-PH\"),J184,EXACT(_FTYPE,\"3PH\"),P184)","v":-13.966423261401992}]
[]
[null,"#Radius"]
[null,"r"]
[null,{"$f":"_xlfn.IFS(EXACT(_FTYPE,\"SLG\"),C186,EXACT(_FTYPE,\"PH-PH\"),I186,EXACT(_FTYPE,\"3PH\"),O186)","v":16.933521374007107}]
[]
[null,"#Circle"]
[null,"Theta","X","Y"]
[null,0,{"$f":"IF(AND(_rc*COS(B199)+_hc>=-_DR,_rc*SIN(B199)+_kc>=-_DX,OR(AND(_H=1,_ZONE=1),AND(_H=1,_ZONE=2,_EPILOTset<>\"N\"))),_rc*COS(B199)+_hc,NA())","v":{"$error":"#N/A"}},{"$f":"IF(AND(_rc*COS(B199)+_hc>=-_DR,_rc*SIN(B199)+_kc>=-_DX,OR(AND(_H=1,_ZONE=1),AND(_H=1,_ZONE=2,_EPILOTset<>\"N\"))),_rc*SIN(B199)+_kc,NA())","v":{"$error":"#N/A"}}]
[null,{"$f":"B199+2*PI()/500","v":1.2566370614359173E-2},{"$error":"#N/A"},{"$error":"#N/A"}]
[null,{"$f":"B200+2*PI()/500","v":2.5132741228718346E-2},{"$error":"#N/A"},{"$error":"#N/A"}]
[null,3.7699111843077518E-2,{"$error":"#N/A"},{"$error":"#N/A"}]
[null,5.0265482457436693E-2,{"$error":"#N/A"},{"$error":"#N/A"}]
[null,6.2831853071795868E-2,{"$error":"#N/A"},{"$error":"#N/A"}]
[null,7.5398223686155036E-2,{"$error":"#N/A"},{"$error":"#N/A"}]
[null,8.7964594300514204E-2,{"$error":"#N/A"},{"$error":"#N/A"}]
[null,0.10053096491487337,{"$error":"#N/A"},{"$error":"#N/A"}]
[null,0.11309733552923254,{"$error":"#N/A"},{"$error":"#N/A"}]
[null,0.12566370614359171,{"$error":"#N/A"},{"$error":"#N/A"}]
[null,0.13823007675795088,{"$error":"#N/A"},{"$error":"#N/A"}]
[null,0.15079644737231004,{"$error":"#N/A"},{"$error":"#N/A"}]
[null,0.16336281798666921,{"$error":"#N/A"},{"$error":"#N/A"}]
[null,0.17592918860102838,{"$error":"#N/A"},{"$error":"#N/A"}]
[null,0.18849555921538755,{"$error":"#N/A"},{"$error":"#N/A"}]
[null,0.20106192982974672,{"$error":"#N/A"},{"$error":"#N/A"}]
[null,0.21362830044410588,{"$error":"#N/A"},{"$error":"#N/A"}]
[null,0.22619467105846505,{"$error":"#N/A"},{"$error":"#N/A"}]
[null,0.23876104167282422,{"$error":"#N/A"},{"$error":"#N/A"}]
[null,0.25132741228718342,{"$error":"#N/A"},{"$error":"#N/A"}]
[null,0.26389378290154258,{"$error":"#N/A"},{"$error":"#N/A"}]
[null,0.27646015351590175,{"$error":"#N/A"},{"$error":"#N/A"}]
[null,0.28902652413026092,{"$error":"#N/A"},{"$error":"#N/A"}]
[null,0.30159289474462009,{"$error":"#N/A"},{"$error":"#N/A"}]
[null,0.31415926535897926,{"$error":"#N/A"},{"$error":"#N/A"}]
[null,0.32672563597333842,{"$error":"#N/A"},{"$error":"#N/A"}]
[null,0.33929200658769759,{"$error":"#N/A"},{"$error":"#N/A"}]
[null,0.35185837720205676,{"$error":"#N/A"},{"$error":"#N/A"}]
[null,0.36442474781641593,{"$error":"#N/A"},{"$error":"#N/A"}]
[null,0.3769911184307751,{"$error":"#N/A"},{"$error":"#N/A"}]
[null,0.38955748904513426,{"$error":"#N/A"},{"$error":"#N/A"}]
[null,0.40212385965949343,{"$error":"#N/A"},{"$error":"#N/A"}]
[null,0.4146902302738526,{"$error":"#N/A"},{"$error":"#N/A"}]
[null,0.42725660088821177,{"$error":"#N/A"},{"$error":"#N/A"}]
[null,0.43982297150257094,{"$error":"#N/A"},{"$error":"#N/A"}]
[null,0.4523893421169301,{"$error":"#N/A"},{"$error":"#N/A"}]
[null,0.46495571273128927,{"$error":"#N/A"},{"$error":"#N/A"}]
[null,0.47752208334564844,{"$error":"#N/A"},{"$error":"#N/A"}]
[null,0.49008845396000761,{"$error":"#N/A"},{"$error":"#N/A"}]
[null,0.50265482457436683,{"$error":"#N/A"},{"$error":"#N/A"}]
[null,0.515221195188726,{"$error":"#N/A"},{"$error":"#N/A"}]
[null,0.52778756580308517,{"$error":"#N/A"},{"$error":"#N/A"}]
[null,0.54035393641744434,{"$error":"#N/A"},{"$error":"#N/A"}]
[null,0.5529203070318035,{"$error":"#N/A"},{"$error":"#N/A"}]
[null,0.56548667764616267,{"$error":"#N/A"},{"$error":"#N/A"}]
[null,0.57805304826052184,{"$error":"#N/A"},{"$error":"#N/A"}]
[null,0.59061941887488101,{"$error":"#N/A"},{"$error":"#N/A"}]
[null,0.60318578948924018,{"$error":"#N/A"},{"$error":"#N/A"}]
[null,0.61575216010359934,{"$error":"#N/A"},{"$error":"#N/A"}]
[null,0.62831853071795851,{"$error":"#N/A"},{"$error":"#N/A"}]
[null,0.64088490133231768,{"$error":"#N/A"},{"$error":"#N/A"}]
[null,0.65345127194667685,{"$error":"#N/A"},{"$error":"#N/A"}]
[null,0.66601764256103602,{"$error":"#N/A"},{"$error":"#N/A"}]
[null,0.67858401317539518,{"$error":"#N/A"},{"$error":"#N/A"}]
[null,0.69115038378975435,{"$error":"#N/A"},{"$error":"#N/A"}]
[null,0.70371675440411352,{"$error":"#N/A"},{"$error":"#N/A"}]
[null,0.71628312501847269,{"$error":"#N/A"},{"$error":"#N/A"}]
[null,0.72884949563283186,{"$error":"#N/A"},{"$error":"#N/A"}]
[null,0.74141586624719102,{"$error":"#N/A"},{"$error":"#N/A"}]
[null,0.75398223686155019,{"$error":"#N/A"},{"$error":"#N/A"}]
[null,0.76654860747590936,{"$error":"#N/A"},{"$error":"#N/A"}]
[null,0.77911497809026853,{"$error":"#N/A"},{"$error":"#N/A"}]
[null,0.7916813487046277,{"$error":"#N/A"},{"$error":"#N/A"}]
[null,0.80424771931898686,{"$f":"IF(AND(_rc*COS(B263)+_hc>=-_DR,_rc*SIN(B263)+_kc>=-_DX,OR(AND(_H=1,_ZONE=1),AND(_H=1,_ZONE=2,_EPILOTset<>\"N\"))),_rc*COS(B263)+_hc,NA())","v":{"$error":"#N/A"}},{"$f":"IF(AND(_rc*COS(B263)+_hc>=-_DR,_rc*SIN(B263)+_kc>=-_DX,OR(AND(_H=1,_ZONE=1),AND(_H=1,_ZONE=2,_EPILOTset<>\"N\"))),_rc*SIN(B263)+_kc,NA())","v":{"$error":"#N/A"}}]
[null,0.81681408993334603,{"$error":"#N/A"},{"$error":"#N/A"}]
[null,{"$f":"B264+2*PI()/500","v":0.8293804605477052},{"$error":"#N/A"},{"$error":"#N/A"}]
[null,0.84194683116206437,{"$error":"#N/A"},{"$error":"#N/A"}]
[null,0.85451320177642354,{"$error":"#N/A"},{"$error":"#N/A"}]
[null,0.8670795723907827,{"$error":"#N/A"},{"$error":"#N/A"}]
[null,0.87964594300514187,10.659720682744187,-0.91892079590264153]
[null,0.89221231361950104,10.494913010725558,-0.78431523895803856]
[null,0.90477868423386021,10.328426892430802,-0.65179128968202349]
[null,0.91734505484821938,10.160288617947968,-0.5213698751424527]
[null,0.92991142546257854,9.9905247382597153,-0.39307159039257478]
[null,0.94247779607693771,9.8191620610506174,-0.26691669521883554]
[null,0.95504416669129688,9.6462276464738999,-0.1429251109416132]
[null,0.96761053730565605,9.471748802878345,-2.1116417269425369E-2]
[null,0.98017690792001522,9.2957530824959811,9.8490150792949649E-2]
[null,0.99274327853437438,9.1182682770912606,0.2158757059818921]
[null,1.0053096491487337,8.939322413572425,0.33102171175745809]
[null,1.0178760197630929,8.7589437495657343,0.44390998523052438]
[null,1.0304423903774522,8.5771607689532505,0.55452270003406312]
[null,1.0430087609918115,8.3940021773749045,0.66284238913814519]
[null,1.0555751316061708,8.2094968976955514,0.7688519476081801]
[null,1.0681415022205301,8.023674065437703,0.87253463530598196]
[null,1.0807078728348893,7.8365630241807036,0.97387407953323724]
[null,1.0932742434492486,7.6481933209270245,1.072854277616937]
[null,1.1058406140636079,7.4585947014364598,1.1694595994363901]
[null,1.1184069846779672,7.2677971055289241,1.2636747898913967]
[null,1.1309733552923265,7.0758306623566085,1.3554849713112063]
[null,1.1435397259066857,6.8827256856462355,1.4448756458038741]
[null,1.156106096521045,6.6885126689121703,1.5318326975456511]
[null,1.1686724671354043,6.4932222806411461,1.6163423950100277]
[null,1.1812388377497636,6.2968853594493464,1.6983913931361059]
[null,1.1938052083641228,6.0995329092126385,1.777966735435939]
[null,1.2063715789784821,5.9011960941706967,1.8550558560405133]
[null,1.2189379495928414,5.7019062340058086,1.9296465816840378]
[null,1.2315043202072007,5.5016947988971374,2.0017271336262539]
[null,1.24407069082156,5.3005934045512104,2.0712861295124227]
[null,1.2566370614359192,5.0986338072094357,2.1383125851707412]
[null,1.2692034320502785,4.8958478986334244,2.2027959163468616]
[null,1.2817698026646378,4.692267701068908,2.264725940375282]
[null,1.2943361732789971,4.4879253621890607,2.3240928777872938]
[null,1.3069025438933564,4.2828531500180009,2.3808873538552717]
[null,1.3194689145077156,4.077083447835304,2.4351004000730612]
[null,1.3320352851220749,3.8706487490623038,2.4867234555722142]
[null,1.3446016557364342,3.6635816521310005,2.5357483684738291]
[null,1.3571680263507935,3.4559148553364007,2.5821673971758408]
[null,1.3697343969651528,3.2476811516730661,2.6259732115755163]
[null,1.382300767579512,3.0389134236567283,2.6671588942269473]
[null,1.3948671381938713,2.8296446381317519,2.7057179414333987]
[null,1.4074335088082306,2.6199078410652925,2.7416442642743348]
[null,1.4199998794225899,2.4097361523289536,2.7749321895669006]
[null,1.4325662500369492,2.1991627604687745,2.805576460761813]
[null,1.4451326206513084,1.9882209174643719,2.833572238773403]
[null,1.4576989912656677,1.7769439334780737,2.85891510274379]
[null,1.470265361880027,1.5653651715948511,2.8816010507409686]
[null,1.4828317324943863,1.3535180425539046,2.9016265003907655]
[null,1.4953981031087455,1.141435999472719,2.9189882894425416]
[null,1.5079644737231048,0.92915253256443031,2.933683676268533]
[null,1.5205308443374641,0.71670116384933158,2.9457103402968166]
[null,1.5330972149518234,0.50411544186135693,2.9550663823777192]
[null,1.5456635855661827,0.29142893635038009,2.9617503250837345]
[null,1.5582299561805419,7.8675232981161636E-2,2.9657611129428361]
[null,1.5707963267949012,-0.13411207197021732,2.9670981126051146]
[null,1.5833626974092605,-0.34689937692159628,2.9657611129428325]
[null,1.5959290680236198,{"$error":"#N/A"},{"$error":"#N/A"}]
[null,1.6084954386379791,{"$f":"IF(AND(_rc*COS(B327)+_hc>=-_DR,_rc*SIN(B327)+_kc>=-_DX,OR(AND(_H=1,_ZONE=1),AND(_H=1,_ZONE=2,_EPILOTset<>\"N\"))),_rc*COS(B327)+_hc,NA())","v":{"$error":"#N/A"}},{"$f":"IF(AND(_rc*COS(B327)+_hc>=-_DR,_rc*SIN(B327)+_kc>=-_DX,OR(AND(_H=1,_ZONE=1),AND(_H=1,_ZONE=2,_EPILOTset<>\"N\"))),_rc*SIN(B327)+_kc,NA())","v":{"$error":"#N/A"}}]
[null,1.6210618092523383,{"$error":"#N/A"},{"$error":"#N/A"}]
[null,{"$f":"B328+2*PI()/500","v":1.6336281798666976},{"$error":"#N/A"},{"$error":"#N/A"}]
[null,1.6461945504810569,{"$error":"#N/A"},{"$error":"#N/A"}]
[null,1.6587609210954162,{"$error":"#N/A"},{"$error":"#N/A"}]
[null,1.6713272917097755,{"$error":"#N/A"},{"$error":"#N/A"}]
[null,1.6838936623241347,{"$error":"#N/A"},{"$error":"#N/A"}]
[null,1.696460032938494,{"$error":"#N/A"},{"$error":"#N/A"}]
[null,1.7090264035528533,{"$error":"#N/A"},{"$error":"#N/A"}]
[null,1.7215927741672126,{"$error":"#N/A"},{"$error":"#N/A"}]
[null,1.7341591447815718,{"$error":"#N/A"},{"$error":"#N/A"}]
[null,1.7467255153959311,{"$error":"#N/A"},{"$error":"#N/A"}]
[null,1.7592918860102904,{"$error":"#N/A"},{"$error":"#N/A"}]
[null,1.7718582566246497,{"$error":"#N/A"},{"$error":"#N/A"}]
[null,1.784424627239009,{"$error":"#N/A"},{"$error":"#N/A"}]
[null,1.7969909978533682,{"$error":"#N/A"},{"$error":"#N/A"}]
[null,1.8095573684677275,{"$error":"#N/A"},{"$error":"#N/A"}]
[null,1.8221237390820868,{"$error":"#N/A"},{"$error":"#N/A"}]
[null,1.8346901096964461,{"$error":"#N/A"},{"$error":"#N/A"}]
[null,1.8472564803108054,{"$error":"#N/A"},{"$error":"#N/A"}]
[null,1.8598228509251646,{"$error":"#N/A"},{"$error":"#N/A"}]
[null,1.8723892215395239,{"$error":"#N/A"},{"$error":"#N/A"}]
[null,1.8849555921538832,{"$error":"#N/A"},{"$error":"#N/A"}]
[null,1.8975219627682425,{"$error":"#N/A"},{"$error":"#N/A"}]
[null,1.9100883333826018,{"$error":"#N/A"},{"$error":"#N/A"}]
[null,1.922654703996961,{"$error":"#N/A"},{"$error":"#N/A"}]
[null,1.9352210746113203,{"$error":"#N/A"},{"$error":"#N/A"}]
[null,1.9477874452256796,{"$error":"#N/A"},{"$error":"#N/A"}]
[null,1.9603538158400389,{"$error":"#N/A"},{"$error":"#N/A"}]
[null,1.9729201864543982,{"$error":"#N/A"},{"$error":"#N/A"}]
[null,1.9854865570687574,{"$error":"#N/A"},{"$error":"#N/A"}]
[null,1.9980529276831167,{"$error":"#N/A"},{"$error":"#N/A"}]
[null,2.0106192982974758,{"$error":"#N/A"},{"$error":"#N/A"}]
[null,2.023185668911835,{"$error":"#N/A"},{"$error":"#N/A"}]
[null,2.0357520395261943,{"$error":"#N/A"},{"$error":"#N/A"}]
[null,2.0483184101405536,{"$error":"#N/A"},{"$error":"#N/A"}]
[null,2.0608847807549129,{"$error":"#N/A"},{"$error":"#N/A"}]
[null,2.0734511513692722,{"$error":"#N/A"},{"$error":"#N/A"}]
[null,2.0860175219836314,{"$error":"#N/A"},{"$error":"#N/A"}]
[null,2.0985838925979907,{"$error":"#N/A"},{"$error":"#N/A"}]
[null,2.11115026321235,{"$error":"#N/A"},{"$error":"#N/A"}]
[null,2.1237166338267093,{"$error":"#N/A"},{"$error":"#N/A"}]
[null,2.1362830044410686,{"$error":"#N/A"},{"$error":"#N/A"}]
[null,2.1488493750554278,{"$error":"#N/A"},{"$error":"#N/A"}]
[null,2.1614157456697871,{"$error":"#N/A"},{"$error":"#N/A"}]
[null,2.1739821162841464,{"$error":"#N/A"},{"$error":"#N/A"}]
[null,2.1865484868985057,{"$error":"#N/A"},{"$error":"#N/A"}]
[null,2.199114857512865,{"$error":"#N/A"},{"$error":"#N/A"}]
[null,2.2116812281272242,{"$error":"#N/A"},{"$error":"#N/A"}]
[null,2.2242475987415835,{"$error":"#N/A"},{"$error":"#N/A"}]
[null,2.2368139693559428,{"$error":"#N/A"},{"$error":"#N/A"}]
[null,2.2493803399703021,{"$error":"#N/A"},{"$error":"#N/A"}]
[null,2.2619467105846613,{"$error":"#N/A"},{"$error":"#N/A"}]
[null,2.2745130811990206,{"$error":"#N/A"},{"$error":"#N/A"}]
[null,2.2870794518133799,{"$error":"#N/A"},{"$error":"#N/A"}]
[null,2.2996458224277392,{"$error":"#N/A"},{"$error":"#N/A"}]
[null,2.3122121930420985,{"$error":"#N/A"},{"$error":"#N/A"}]
[null,2.3247785636564577,{"$error":"#N/A"},{"$error":"#N/A"}]
[null,2.337344934270817,{"$error":"#N/A"},{"$error":"#N/A"}]
[null,2.3499113048851763,{"$error":"#N/A"},{"$error":"#N/A"}]
[null,2.3624776754995356,{"$error":"#N/A"},{"$error":"#N/A"}]
[null,2.3750440461138949,{"$error":"#N/A"},{"$error":"#N/A"}]
[null,2.3876104167282541,{"$error":"#N/A"},{"$error":"#N/A"}]
[null,2.4001767873426134,{"$error":"#N/A"},{"$error":"#N/A"}]
[null,2.4127431579569727,{"$f":"IF(AND(_rc*COS(B391)+_hc>=-_DR,_rc*SIN(B391)+_kc>=-_DX,OR(AND(_H=1,_ZONE=1),AND(_H=1,_ZONE=2,_EPILOTset<>\"N\"))),_rc*COS(B391)+_hc,NA())","v":{"$error":"#N/A"}},{"$f":"IF(AND(_rc*COS(B391)+_hc>=-_DR,_rc*SIN(B391)+_kc>=-_DX,OR(AND(_H=1,_ZONE=1),AND(_H=1,_ZONE=2,_EPILOTset<>\"N\"))),_rc*SIN(B391)+_kc,NA())","v":{"$error":"#N/A"}}]
[null,2.425309528571332,{"$error":"#N/A"},{"$error":"#N/A"}]
[null,{"$f":"B392+2*PI()/500","v":2.4378758991856913},{"$error":"#N/A"},{"$error":"#N/A"}]
[null,2.4504422698000505,{"$error":"#N/A"},{"$error":"#N/A"}]
[null,2.4630086404144098,{"$error":"#N/A"},{"$error":"#N/A"}]
[null,2.4755750110287691,{"$error":"#N/A"},{"$error":"#N/A"}]
[null,2.4881413816431284,{"$error":"#N/A"},{"$error":"#N/A"}]
[null,2.5007077522574876,{"$error":"#N/A"},{"$error":"#N/A"}]
[null,2.5132741228718469,{"$error":"#N/A"},{"$error":"#N/A"}]
[null,2.5258404934862062,{"$error":"#N/A"},{"$error":"#N/A"}]
[null,2.5384068641005655,{"$error":"#N/A"},{"$error":"#N/A"}]
[null,2.5509732347149248,{"$error":"#N/A"},{"$error":"#N/A"}]
[null,2.563539605329284,{"$error":"#N/A"},{"$error":"#N/A"}]
[null,2.5761059759436433,{"$error":"#N/A"},{"$error":"#N/A"}]
[null,2.5886723465580026,{"$error":"#N/A"},{"$error":"#N/A"}]
[null,2.6012387171723619,{"$error":"#N/A"},{"$error":"#N/A"}]
[null,2.6138050877867212,{"$error":"#N/A"},{"$error":"#N/A"}]
[null,2.6263714584010804,{"$error":"#N/A"},{"$error":"#N/A"}]
[null,2.6389378290154397,{"$error":"#N/A"},{"$error":"#N/A"}]
[null,2.651504199629799,{"$error":"#N/A"},{"$error":"#N/A"}]
[null,2.6640705702441583,{"$error":"#N/A"},{"$error":"#N/A"}]
[null,2.6766369408585176,{"$error":"#N/A"},{"$error":"#N/A"}]
[null,2.6892033114728768,{"$error":"#N/A"},{"$error":"#N/A"}]
[null,2.7017696820872361,{"$error":"#N/A"},{"$error":"#N/A"}]
[null,2.7143360527015954,{"$error":"#N/A"},{"$error":"#N/A"}]
[null,2.7269024233159547,{"$error":"#N/A"},{"$error":"#N/A"}]
[null,2.739468793930314,{"$error":"#N/A"},{"$error":"#N/A"}]
[null,2.7520351645446732,{"$error":"#N/A"},{"$error":"#N/A"}]
[null,2.7646015351590325,{"$error":"#N/A"},{"$error":"#N/A"}]
[null,2.7771679057733918,{"$error":"#N/A"},{"$error":"#N/A"}]
[null,2.7897342763877511,{"$error":"#N/A"},{"$error":"#N/A"}]
[null,2.8023006470021103,{"$error":"#N/A"},{"$error":"#N/A"}]
[null,2.8148670176164696,{"$error":"#N/A"},{"$error":"#N/A"}]
[null,2.8274333882308289,{"$error":"#N/A"},{"$error":"#N/A"}]
[null,2.8399997588451882,{"$error":"#N/A"},{"$error":"#N/A"}]
[null,2.8525661294595475,{"$error":"#N/A"},{"$error":"#N/A"}]
[null,2.8651325000739067,{"$error":"#N/A"},{"$error":"#N/A"}]
[null,2.877698870688266,{"$error":"#N/A"},{"$error":"#N/A"}]
[null,2.8902652413026253,{"$error":"#N/A"},{"$error":"#N/A"}]
[null,2.9028316119169846,{"$error":"#N/A"},{"$error":"#N/A"}]
[null,2.9153979825313439,{"$error":"#N/A"},{"$error":"#N/A"}]
[null,2.9279643531457031,{"$error":"#N/A"},{"$error":"#N/A"}]
[null,2.9405307237600624,{"$error":"#N/A"},{"$error":"#N/A"}]
[null,2.9530970943744217,{"$error":"#N/A"},{"$error":"#N/A"}]
[null,2.965663464988781,{"$error":"#N/A"},{"$error":"#N/A"}]
[null,2.9782298356031403,{"$error":"#N/A"},{"$error":"#N/A"}]
[null,2.9907962062174995,{"$error":"#N/A"},{"$error":"#N/A"}]
[null,3.0033625768318588,{"$error":"#N/A"},{"$error":"#N/A"}]
[null,3.0159289474462181,{"$error":"#N/A"},{"$error":"#N/A"}]
[null,3.0284953180605774,{"$error":"#N/A"},{"$error":"#N/A"}]
[null,3.0410616886749366,{"$error":"#N/A"},{"$error":"#N/A"}]
[null,3.0536280592892959,{"$error":"#N/A"},{"$error":"#N/A"}]
[null,3.0661944299036552,{"$error":"#N/A"},{"$error":"#N/A"}]
[null,3.0787608005180145,{"$error":"#N/A"},{"$error":"#N/A"}]
[null,3.0913271711323738,{"$error":"#N/A"},{"$error":"#N/A"}]
[null,3.103893541746733,{"$error":"#N/A"},{"$error":"#N/A"}]
[null,3.1164599123610923,{"$error":"#N/A"},{"$error":"#N/A"}]
[null,3.1290262829754516,{"$error":"#N/A"},{"$error":"#N/A"}]
[null,3.1415926535898109,{"$error":"#N/A"},{"$error":"#N/A"}]
[null,3.1541590242041702,{"$error":"#N/A"},{"$error":"#N/A"}]
[null,3.1667253948185294,{"$error":"#N/A"},{"$error":"#N/A"}]
[null,3.1792917654328887,{"$error":"#N/A"},{"$error":"#N/A"}]
[null,3.191858136047248,{"$error":"#N/A"},{"$error":"#N/A"}]
[null,3.2044245066616073,{"$error":"#N/A"},{"$error":"#N/A"}]
[null,3.2169908772759666,{"$f":"IF(AND(_rc*COS(B455)+_hc>=-_DR,_rc*SIN(B455)+_kc>=-_DX,OR(AND(_H=1,_ZONE=1),AND(_H=1,_ZONE=2,_EPILOTset<>\"N\"))),_rc*COS(B455)+_hc,NA())","v":{"$error":"#N/A"}},{"$f":"IF(AND(_rc*COS(B455)+_hc>=-_DR,_rc*SIN(B455)+_kc>=-_DX,OR(AND(_H=1,_ZONE=1),AND(_H=1,_ZONE=2,_EPILOTset<>\"N\"))),_rc*SIN(B455)+_kc,NA())","v":{"$error":"#N/A"}}]
[null,3.2295572478903258,{"$error":"#N/A"},{"$error":"#N/A"}]
[null,{"$f":"B456+2*PI()/500","v":3.2421236185046851},{"$error":"#N/A"},{"$error":"#N/A"}]
[null,3.2546899891190444,{"$error":"#N/A"},{"$error":"#N/A"}]
[null,3.2672563597334037,{"$error":"#N/A"},{"$error":"#N/A"}]
[null,3.2798227303477629,{"$error":"#N/A"},{"$error":"#N/A"}]
[null,3.2923891009621222,{"$error":"#N/A"},{"$error":"#N/A"}]
[null,3.3049554715764815,{"$error":"#N/A"},{"$error":"#N/A"}]
[null,3.3175218421908408,{"$error":"#N/A"},{"$error":"#N/A"}]
[null,3.3300882128052001,{"$error":"#N/A"},{"$error":"#N/A"}]
[null,3.3426545834195593,{"$error":"#N/A"},{"$error":"#N/A"}]
[null,3.3552209540339186,{"$error":"#N/A"},{"$error":"#N/A"}]
[null,3.3677873246482779,{"$error":"#N/A"},{"$error":"#N/A"}]
[null,3.3803536952626372,{"$error":"#N/A"},{"$error":"#N/A"}]
[null,3.3929200658769965,{"$error":"#N/A"},{"$error":"#N/A"}]
[null,3.4054864364913557,{"$error":"#N/A"},{"$error":"#N/A"}]
[null,3.418052807105715,{"$error":"#N/A"},{"$error":"#N/A"}]
[null,3.4306191777200743,{"$error":"#N/A"},{"$error":"#N/A"}]
[null,3.4431855483344336,{"$error":"#N/A"},{"$error":"#N/A"}]
[null,3.4557519189487929,{"$error":"#N/A"},{"$error":"#N/A"}]
[null,3.4683182895631521,{"$error":"#N/A"},{"$error":"#N/A"}]
[null,3.4808846601775114,{"$error":"#N/A"},{"$error":"#N/A"}]
[null,3.4934510307918707,{"$error":"#N/A"},{"$error":"#N/A"}]
[null,3.50601740140623,{"$error":"#N/A"},{"$error":"#N/A"}]
[null,3.5185837720205893,{"$error":"#N/A"},{"$error":"#N/A"}]
[null,3.5311501426349485,{"$error":"#N/A"},{"$error":"#N/A"}]
[null,3.5437165132493078,{"$error":"#N/A"},{"$error":"#N/A"}]
[null,3.5562828838636671,{"$error":"#N/A"},{"$error":"#N/A"}]
[null,3.5688492544780264,{"$error":"#N/A"},{"$error":"#N/A"}]
[null,3.5814156250923856,{"$error":"#N/A"},{"$error":"#N/A"}]
[null,3.5939819957067449,{"$error":"#N/A"},{"$error":"#N/A"}]
[null,3.6065483663211042,{"$error":"#N/A"},{"$error":"#N/A"}]
[null,3.6191147369354635,{"$error":"#N/A"},{"$error":"#N/A"}]
[null,3.6316811075498228,{"$error":"#N/A"},{"$error":"#N/A"}]
[null,3.644247478164182,{"$error":"#N/A"},{"$error":"#N/A"}]
[null,3.6568138487785413,{"$error":"#N/A"},{"$error":"#N/A"}]
[null,3.6693802193929006,{"$error":"#N/A"},{"$error":"#N/A"}]
[null,3.6819465900072599,{"$error":"#N/A"},{"$error":"#N/A"}]
[null,3.6945129606216192,{"$error":"#N/A"},{"$error":"#N/A"}]
[null,3.7070793312359784,{"$error":"#N/A"},{"$error":"#N/A"}]
[null,3.7196457018503377,{"$error":"#N/A"},{"$error":"#N/A"}]
[null,3.732212072464697,{"$error":"#N/A"},{"$error":"#N/A"}]
[null,3.7447784430790563,{"$error":"#N/A"},{"$error":"#N/A"}]
[null,3.7573448136934156,{"$error":"#N/A"},{"$error":"#N/A"}]
[null,3.7699111843077748,{"$error":"#N/A"},{"$error":"#N/A"}]
[null,3.7824775549221341,{"$error":"#N/A"},{"$error":"#N/A"}]
[null,3.7950439255364934,{"$error":"#N/A"},{"$error":"#N/A"}]
[null,3.8076102961508527,{"$error":"#N/A"},{"$error":"#N/A"}]
[null,3.8201766667652119,{"$error":"#N/A"},{"$error":"#N/A"}]
[null,3.8327430373795712,{"$error":"#N/A"},{"$error":"#N/A"}]
[null,3.8453094079939305,{"$error":"#N/A"},{"$error":"#N/A"}]
[null,3.8578757786082898,{"$error":"#N/A"},{"$error":"#N/A"}]
[null,3.8704421492226491,{"$error":"#N/A"},{"$error":"#N/A"}]
[null,3.8830085198370083,{"$error":"#N/A"},{"$error":"#N/A"}]
[null,3.8955748904513676,{"$error":"#N/A"},{"$error":"#N/A"}]
[null,3.9081412610657269,{"$error":"#N/A"},{"$error":"#N/A"}]
[null,3.9207076316800862,{"$error":"#N/A"},{"$error":"#N/A"}]
[null,3.9332740022944455,{"$error":"#N/A"},{"$error":"#N/A"}]
[null,3.9458403729088047,{"$error":"#N/A"},{"$error":"#N/A"}]
[null,3.958406743523164,{"$error":"#N/A"},{"$error":"#N/A"}]
[null,3.9709731141375233,{"$error":"#N/A"},{"$error":"#N/A"}]
[null,3.9835394847518826,{"$error":"#N/A"},{"$error":"#N/A"}]
[null,3.9961058553662419,{"$error":"#N/A"},{"$error":"#N/A"}]
[null,4.0086722259806011,{"$error":"#N/A"},{"$error":"#N/A"}]
[null,4.0212385965949604,{"$f":"IF(AND(_rc*COS(B519)+_hc>=-_DR,_rc*SIN(B519)+_kc>=-_DX,OR(AND(_H=1,_ZONE=1),AND(_H=1,_ZONE=2,_EPILOTset<>\"N\"))),_rc*COS(B519)+_hc,NA())","v":{"$error":"#N/A"}},{"$f":"IF(AND(_rc*COS(B519)+_hc>=-_DR,_rc*SIN(B519)+_kc>=-_DX,OR(AND(_H=1,_ZONE=1),AND(_H=1,_ZONE=2,_EPILOTset<>\"N\"))),_rc*SIN(B519)+_kc,NA())","v":{"$error":"#N/A"}}]
[null,4.0338049672093197,{"$error":"#N/A"},{"$error":"#N/A"}]
[null,{"$f":"B520+2*PI()/500","v":4.046371337823679},{"$error":"#N/A"},{"$error":"#N/A"}]
[null,4.0589377084380382,{"$error":"#N/A"},{"$error":"#N/A"}]
[null,4.0715040790523975,{"$error":"#N/A"},{"$error":"#N/A"}]
[null,4.0840704496667568,{"$error":"#N/A"},{"$error":"#N/A"}]
[null,4.0966368202811161,{"$error":"#N/A"},{"$error":"#N/A"}]
[null,4.1092031908954754,{"$error":"#N/A"},{"$error":"#N/A"}]
[null,4.1217695615098346,{"$error":"#N/A"},{"$error":"#N/A"}]
[null,4.1343359321241939,{"$error":"#N/A"},{"$error":"#N/A"}]
[null,4.1469023027385532,{"$error":"#N/A"},{"$error":"#N/A"}]
[null,4.1594686733529125,{"$error":"#N/A"},{"$error":"#N/A"}]
[null,4.1720350439672718,{"$error":"#N/A"},{"$error":"#N/A"}]
[null,4.184601414581631,{"$error":"#N/A"},{"$error":"#N/A"}]
[null,4.1971677851959903,{"$error":"#N/A"},{"$error":"#N/A"}]
[null,4.2097341558103496,{"$error":"#N/A"},{"$error":"#N/A"}]
[null,4.2223005264247089,{"$error":"#N/A"},{"$error":"#N/A"}]
[null,4.2348668970390682,{"$error":"#N/A"},{"$error":"#N/A"}]
[null,4.2474332676534274,{"$error":"#N/A"},{"$error":"#N/A"}]
[null,4.2599996382677867,{"$error":"#N/A"},{"$error":"#N/A"}]
[null,4.272566008882146,{"$error":"#N/A"},{"$error":"#N/A"}]
[null,4.2851323794965053,{"$error":"#N/A"},{"$error":"#N/A"}]
[null,4.2976987501108646,{"$error":"#N/A"},{"$error":"#N/A"}]
[null,4.3102651207252238,{"$error":"#N/A"},{"$error":"#N/A"}]
[null,4.3228314913395831,{"$error":"#N/A"},{"$error":"#N/A"}]
[null,4.3353978619539424,{"$error":"#N/A"},{"$error":"#N/A"}]
[null,4.3479642325683017,{"$error":"#N/A"},{"$error":"#N/A"}]
[null,4.3605306031826609,{"$error":"#N/A"},{"$error":"#N/A"}]
[null,4.3730969737970202,{"$error":"#N/A"},{"$error":"#N/A"}]
[null,4.3856633444113795,{"$error":"#N/A"},{"$error":"#N/A"}]
[null,4.3982297150257388,{"$error":"#N/A"},{"$error":"#N/A"}]
[null,4.4107960856400981,{"$error":"#N/A"},{"$error":"#N/A"}]
[null,4.4233624562544573,{"$error":"#N/A"},{"$error":"#N/A"}]
[null,4.4359288268688166,{"$error":"#N/A"},{"$error":"#N/A"}]
[null,4.4484951974831759,{"$error":"#N/A"},{"$error":"#N/A"}]
[null,4.4610615680975352,{"$error":"#N/A"},{"$error":"#N/A"}]
[null,4.4736279387118945,{"$error":"#N/A"},{"$error":"#N/A"}]
[null,4.4861943093262537,{"$error":"#N/A"},{"$error":"#N/A"}]
[null,4.498760679940613,{"$error":"#N/A"},{"$error":"#N/A"}]
[null,4.5113270505549723,{"$error":"#N/A"},{"$error":"#N/A"}]
[null,4.5238934211693316,{"$error":"#N/A"},{"$error":"#N/A"}]
[null,4.5364597917836909,{"$error":"#N/A"},{"$error":"#N/A"}]
[null,4.5490261623980501,{"$error":"#N/A"},{"$error":"#N/A"}]
[null,4.5615925330124094,{"$error":"#N/A"},{"$error":"#N/A"}]
[null,4.5741589036267687,{"$error":"#N/A"},{"$error":"#N/A"}]
[null,4.586725274241128,{"$error":"#N/A"},{"$error":"#N/A"}]
[null,4.5992916448554872,{"$error":"#N/A"},{"$error":"#N/A"}]
[null,4.6118580154698465,{"$error":"#N/A"},{"$error":"#N/A"}]
[null,4.6244243860842058,{"$error":"#N/A"},{"$error":"#N/A"}]
[null,4.6369907566985651,{"$error":"#N/A"},{"$error":"#N/A"}]
[null,4.6495571273129244,{"$error":"#N/A"},{"$error":"#N/A"}]
[null,4.6621234979272836,{"$error":"#N/A"},{"$error":"#N/A"}]
[null,4.6746898685416429,{"$error":"#N/A"},{"$error":"#N/A"}]
[null,4.6872562391560022,{"$error":"#N/A"},{"$error":"#N/A"}]
[null,4.6998226097703615,{"$error":"#N/A"},{"$error":"#N/A"}]
[null,4.7123889803847208,{"$error":"#N/A"},{"$error":"#N/A"}]
[null,4.72495535099908,{"$error":"#N/A"},{"$error":"#N/A"}]
[null,4.7375217216134393,{"$error":"#N/A"},{"$error":"#N/A"}]
[null,4.7500880922277986,{"$error":"#N/A"},{"$error":"#N/A"}]
[null,4.7626544628421579,{"$error":"#N/A"},{"$error":"#N/A"}]
[null,4.7752208334565172,{"$error":"#N/A"},{"$error":"#N/A"}]
[null,4.7877872040708764,{"$error":"#N/A"},{"$error":"#N/A"}]
[null,4.8003535746852357,{"$error":"#N/A"},{"$error":"#N/A"}]
[null,4.812919945299595,{"$error":"#N/A"},{"$error":"#N/A"}]
[null,4.8254863159139543,{"$f":"IF(AND(_rc*COS(B583)+_hc>=-_DR,_rc*SIN(B583)+_kc>=-_DX,OR(AND(_H=1,_ZONE=1),AND(_H=1,_ZONE=2,_EPILOTset<>\"N\"))),_rc*COS(B583)+_hc,NA())","v":{"$error":"#N/A"}},{"$f":"IF(AND(_rc*COS(B583)+_hc>=-_DR,_rc*SIN(B583)+_kc>=-_DX,OR(AND(_H=1,_ZONE=1),AND(_H=1,_ZONE=2,_EPILOTset<>\"N\"))),_rc*SIN(B583)+_kc,NA())","v":{"$error":"#N/A"}}]
[null,4.8380526865283136,{"$error":"#N/A"},{"$error":"#N/A"}]
[null,{"$f":"B584+2*PI()/500","v":4.8506190571426728},{"$error":"#N/A"},{"$error":"#N/A"}]
[null,4.8631854277570321,{"$error":"#N/A"},{"$error":"#N/A"}]
[null,4.8757517983713914,{"$error":"#N/A"},{"$error":"#N/A"}]
[null,4.8883181689857507,{"$error":"#N/A"},{"$error":"#N/A"}]
[null,4.9008845396001099,{"$error":"#N/A"},{"$error":"#N/A"}]
[null,4.9134509102144692,{"$error":"#N/A"},{"$error":"#N/A"}]
[null,4.9260172808288285,{"$error":"#N/A"},{"$error":"#N/A"}]
[null,4.9385836514431878,{"$error":"#N/A"},{"$error":"#N/A"}]
[null,4.9511500220575471,{"$error":"#N/A"},{"$error":"#N/A"}]
[null,4.9637163926719063,{"$error":"#N/A"},{"$error":"#N/A"}]
[null,4.9762827632862656,{"$error":"#N/A"},{"$error":"#N/A"}]
[null,4.9888491339006249,{"$error":"#N/A"},{"$error":"#N/A"}]
[null,5.0014155045149842,{"$error":"#N/A"},{"$error":"#N/A"}]
[null,5.0139818751293435,{"$error":"#N/A"},{"$error":"#N/A"}]
[null,5.0265482457437027,{"$error":"#N/A"},{"$error":"#N/A"}]
[null,5.039114616358062,{"$error":"#N/A"},{"$error":"#N/A"}]
[null,5.0516809869724213,{"$error":"#N/A"},{"$error":"#N/A"}]
[null,5.0642473575867806,{"$error":"#N/A"},{"$error":"#N/A"}]
[null,5.0768137282011399,{"$error":"#N/A"},{"$error":"#N/A"}]
[null,5.0893800988154991,{"$error":"#N/A"},{"$error":"#N/A"}]
[null,5.1019464694298584,{"$error":"#N/A"},{"$error":"#N/A"}]
[null,5.1145128400442177,{"$error":"#N/A"},{"$error":"#N/A"}]
[null,5.127079210658577,{"$error":"#N/A"},{"$error":"#N/A"}]
[null,5.1396455812729362,{"$error":"#N/A"},{"$error":"#N/A"}]
[null,5.1522119518872955,{"$error":"#N/A"},{"$error":"#N/A"}]
[null,5.1647783225016548,{"$error":"#N/A"},{"$error":"#N/A"}]
[null,5.1773446931160141,{"$error":"#N/A"},{"$error":"#N/A"}]
[null,5.1899110637303734,{"$error":"#N/A"},{"$error":"#N/A"}]
[null,5.2024774343447326,{"$error":"#N/A"},{"$error":"#N/A"}]
[null,5.2150438049590919,{"$error":"#N/A"},{"$error":"#N/A"}]
[null,5.2276101755734512,{"$error":"#N/A"},{"$error":"#N/A"}]
[null,5.2401765461878105,{"$error":"#N/A"},{"$error":"#N/A"}]
[null,5.2527429168021698,{"$error":"#N/A"},{"$error":"#N/A"}]
[null,5.265309287416529,{"$error":"#N/A"},{"$error":"#N/A"}]
[null,5.2778756580308883,{"$error":"#N/A"},{"$error":"#N/A"}]
[null,5.2904420286452476,{"$error":"#N/A"},{"$error":"#N/A"}]
[null,5.3030083992596069,{"$error":"#N/A"},{"$error":"#N/A"}]
[null,5.3155747698739662,{"$error":"#N/A"},{"$error":"#N/A"}]
[null,5.3281411404883254,{"$error":"#N/A"},{"$error":"#N/A"}]
[null,5.3407075111026847,{"$error":"#N/A"},{"$error":"#N/A"}]
[null,5.353273881717044,{"$error":"#N/A"},{"$error":"#N/A"}]
[null,5.3658402523314033,{"$error":"#N/A"},{"$error":"#N/A"}]
[null,5.3784066229457625,{"$error":"#N/A"},{"$error":"#N/A"}]
[null,5.3909729935601218,{"$error":"#N/A"},{"$error":"#N/A"}]
[null,5.4035393641744811,{"$error":"#N/A"},{"$error":"#N/A"}]
[null,5.4161057347888404,{"$error":"#N/A"},{"$error":"#N/A"}]
[null,5.4286721054031997,{"$error":"#N/A"},{"$error":"#N/A"}]
[null,{"$f":"B631+2*PI()/500","v":5.4412384760175589},{"$error":"#N/A"},{"$error":"#N/A"}]
[null,{"$f":"B632+2*PI()/500","v":5.4538048466319182},{"$error":"#N/A"},{"$error":"#N/A"}]
[null,5.4663712172462775,{"$error":"#N/A"},{"$error":"#N/A"}]
[null,5.4789375878606368,{"$error":"#N/A"},{"$error":"#N/A"}]
[null,5.4915039584749961,{"$error":"#N/A"},{"$error":"#N/A"}]
[null,5.5040703290893553,{"$error":"#N/A"},{"$error":"#N/A"}]
[null,5.5166366997037146,{"$error":"#N/A"},{"$error":"#N/A"}]
[null,5.5292030703180739,{"$error":"#N/A"},{"$error":"#N/A"}]
[null,5.5417694409324332,{"$error":"#N/A"},{"$error":"#N/A"}]
[null,5.5543358115467925,{"$error":"#N/A"},{"$error":"#N/A"}]
[null,5.5669021821611517,{"$error":"#N/A"},{"$error":"#N/A"}]
[null,5.579468552775511,{"$error":"#N/A"},{"$error":"#N/A"}]
[null,5.5920349233898703,{"$error":"#N/A"},{"$error":"#N/A"}]
[null,5.6046012940042296,{"$error":"#N/A"},{"$error":"#N/A"}]
[null,5.6171676646185889,{"$error":"#N/A"},{"$error":"#N/A"}]
[null,5.6297340352329481,{"$f":"IF(AND(_rc*COS(B647)+_hc>=-_DR,_rc*SIN(B647)+_kc>=-_DX,OR(AND(_H=1,_ZONE=1),AND(_H=1,_ZONE=2,_EPILOTset<>\"N\"))),_rc*COS(B647)+_hc,NA())","v":{"$error":"#N/A"}},{"$f":"IF(AND(_rc*COS(B647)+_hc>=-_DR,_rc*SIN(B647)+_kc>=-_DX,OR(AND(_H=1,_ZONE=1),AND(_H=1,_ZONE=2,_EPILOTset<>\"N\"))),_rc*SIN(B647)+_kc,NA())","v":{"$error":"#N/A"}}]
[null,5.6423004058473074,{"$error":"#N/A"},{"$error":"#N/A"}]
[null,5.6548667764616667,{"$error":"#N/A"},{"$error":"#N/A"}]
[null,5.667433147076026,{"$error":"#N/A"},{"$error":"#N/A"}]
[null,5.6799995176903852,{"$error":"#N/A"},{"$error":"#N/A"}]
[null,5.6925658883047445,{"$error":"#N/A"},{"$error":"#N/A"}]
[null,5.7051322589191038,{"$error":"#N/A"},{"$error":"#N/A"}]
[null,5.7176986295334631,{"$error":"#N/A"},{"$error":"#N/A"}]
[null,5.7302650001478224,{"$error":"#N/A"},{"$error":"#N/A"}]
[null,5.7428313707621816,{"$error":"#N/A"},{"$error":"#N/A"}]
[null,5.7553977413765409,{"$error":"#N/A"},{"$error":"#N/A"}]
[null,5.7679641119909002,{"$error":"#N/A"},{"$error":"#N/A"}]
[null,5.7805304826052595,{"$error":"#N/A"},{"$error":"#N/A"}]
[null,5.7930968532196188,{"$error":"#N/A"},{"$error":"#N/A"}]
[null,5.805663223833978,{"$error":"#N/A"},{"$error":"#N/A"}]
[null,5.8182295944483373,{"$error":"#N/A"},{"$error":"#N/A"}]
[null,5.8307959650626966,{"$error":"#N/A"},{"$error":"#N/A"}]
[null,5.8433623356770559,{"$error":"#N/A"},{"$error":"#N/A"}]
[null,5.8559287062914152,{"$error":"#N/A"},{"$error":"#N/A"}]
[null,5.8684950769057744,{"$error":"#N/A"},{"$error":"#N/A"}]
[null,5.8810614475201337,{"$error":"#N/A"},{"$error":"#N/A"}]
[null,5.893627818134493,{"$error":"#N/A"},{"$error":"#N/A"}]
[null,5.9061941887488523,{"$error":"#N/A"},{"$error":"#N/A"}]
[null,5.9187605593632115,{"$error":"#N/A"},{"$error":"#N/A"}]
[null,5.9313269299775708,{"$error":"#N/A"},{"$error":"#N/A"}]
[null,5.9438933005919301,{"$error":"#N/A"},{"$error":"#N/A"}]
[null,5.9564596712062894,{"$error":"#N/A"},{"$error":"#N/A"}]
[null,5.9690260418206487,{"$error":"#N/A"},{"$error":"#N/A"}]
[null,5.9815924124350079,{"$error":"#N/A"},{"$error":"#N/A"}]
[null,5.9941587830493672,{"$error":"#N/A"},{"$error":"#N/A"}]
[null,6.0067251536637265,{"$error":"#N/A"},{"$error":"#N/A"}]
[null,6.0192915242780858,{"$error":"#N/A"},{"$error":"#N/A"}]
[null,6.0318578948924451,{"$error":"#N/A"},{"$error":"#N/A"}]
[null,6.0444242655068043,{"$error":"#N/A"},{"$error":"#N/A"}]
[null,6.0569906361211636,{"$error":"#N/A"},{"$error":"#N/A"}]
[null,6.0695570067355229,{"$error":"#N/A"},{"$error":"#N/A"}]
[null,6.0821233773498822,{"$error":"#N/A"},{"$error":"#N/A"}]
[null,6.0946897479642415,{"$error":"#N/A"},{"$error":"#N/A"}]
[null,6.1072561185786007,{"$error":"#N/A"},{"$error":"#N/A"}]
[null,6.11982248919296,{"$error":"#N/A"},{"$error":"#N/A"}]
[null,6.1323888598073193,{"$error":"#N/A"},{"$error":"#N/A"}]
[null,6.1449552304216786,{"$error":"#N/A"},{"$error":"#N/A"}]
[null,6.1575216010360379,{"$error":"#N/A"},{"$error":"#N/A"}]
[null,6.1700879716503971,{"$error":"#N/A"},{"$error":"#N/A"}]
[null,6.1826543422647564,{"$error":"#N/A"},{"$error":"#N/A"}]
[null,6.1952207128791157,{"$error":"#N/A"},{"$error":"#N/A"}]
[null,6.207787083493475,{"$error":"#N/A"},{"$error":"#N/A"}]
[null,6.2203534541078342,{"$error":"#N/A"},{"$error":"#N/A"}]
[null,6.2329198247221935,{"$error":"#N/A"},{"$error":"#N/A"}]
[null,6.2454861953365528,{"$error":"#N/A"},{"$error":"#N/A"}]
[null,{"$f":"B696+2*PI()/500","v":6.2580525659509121},{"$error":"#N/A"},{"$error":"#N/A"}]
[null,6.2706189365652714,{"$error":"#N/A"},{"$error":"#N/A"}]

{"sheet":"Revisions","index":4,"n_rows":20,"n_cols":4,"rows_kept":20,"cut":false,"hidden":true,"merged":[]}
[]
[]
[]
[null,"Version",null,"Notes"]
[null,1.01,null,"Initial Release"]
[null,1.02,null,"Modified 2nd reatance blinder for Zone 2 to use the TANG value from Zone 1"]
[null,1.03,null,"Modified Zone 5 to properly model for the reverse setting"]
[null,1.04,null,"Added 2nd reactance blinder circle characteristics. Removed \"initialize\" button."]
[null,1.05,null,"Graph now auto scales when clicking on the tab. Added FS line for PH-PH faults. Modified Quad shapes when reactance blinder is below bottom of quad. "]
[null,null,null,"Modified line equation to better reflect when Z1ANG~90. Added Info tab for macro security information."]
[null,null,null,"Modified Zone 5 when the resistive reach is large and the tilt angle causes both reactance blinders to be above or below the horizontal axis.  "]
[null,null,null,"Modified the graph reset limits for high resistive reach Zone 5 plots."]
[null,1.06,null,"Added OC supervision and ratio checks to the FS logic for scenarios with low sequence currents."]
[null,1.07,null,"Hid the IPOL vector on the graph. Only the curved characteristic is required.  Fixed the test voltage angles for ph-ph faults.  "]
[null,null,null,"This ensures VBC will be at -90 degrees or +90 degrees (depending on phase rotation), and the second reactance blinder (green) is valid."]
[null,null,null,"Cosmetic changes."]
[null,1.08,null,"Added rule so DR and DX >=0.5.  Forced PH-PH voltage test magnitude to be equal."]
[null,1.0900000000000001,null,"Removed the FS line for Zone 5."]
[null,1.1000000000000001,null,"Modified wording on Graph sheet."]
[null,1.1100000000000001,null,"Cosmetic and wording changes."]