{"text_format":"1","workbook":"xlsx","n_sheets":5,"sheets":["Settings","Graph","Info","Calcs","Revisions"],"not_rendered":{"charts":1,"images":0,"macros":1,"external_links":0,"defined_names":116,"comments":0,"pivot_tables":0},"unopened":[],"bounds":{"document_bytes":16777216,"sheet_cells":100000,"rows_first":2000,"rows_last":500,"rows_between":2000,"halvings":0,"cell_chars":16384,"cell_head_chars":4096},"cells_cut":0,"cells_raw":0,"read":"whole","date_system":"1900"}

{"sheet":"Settings","index":0,"n_rows":27,"n_cols":29,"rows_kept":27,"cut":false,"hidden":false,"merged":[]}
[]
[null,null,"Test Conditions",null,null,null,"T401L QUADRILATERAL TESTING SPREADSHEET",null,null,null,null,null,null,"version 1.09",null,null,null,null,null,null,null,null,null,null,null,"F",null,null,5]
[null,null,"INOM",5,"A secondary",null,"This spreadsheet helps users test the quadrilateral elements in the SEL-T401L.  Enable macros for best experience!",null,null,null,null,null,null,null,null,null,null,null,null,null,null,null,null,null,null,"R",null,null,1]
[null,null,"Fault Type","SLG",null,null,"It is provided as-is, without warranty, either expressed or implied. Its use is the sole responsibility of the user.",null,null,null,null,null,null,null,null,null,null,null,null,null,null,null,null,null,null,null,null,null,"ABC"]
[null,null,"Zone",1,null,null,"Refer to application guide AG 2021-XX  for more information (available at https://www.selinc.com).",null,null,null,null,null,null,null,null,null,null,null,null,null,null,null,null,null,null,null,null,null,"ACB"]
[null,null,null,null,null,null,null,null,null,null,null,null,null,null,null,null,null,null,null,null,null,null,null,null,null,null,null,null,"SLG"]
[null,null,"Relay Settings",null,null,null,null,null,null,null,null,null,null,null,null,null,null,null,null,null,null,null,null,null,null,null,null,null,"PH-PH"]
[null,null,"PHROT","ABC",null,null,"Settings Instructions",null,null,null,null,null,null,null,null,null,null,null,null,null,null,null,null,null,null,null,null,null,"3PH"]
[null,null,"VNOMY",115,"L-L V secondary",null,"1. Enable macros if prompted.  See the Info worksheet for more information.",null,null,null,null,null,null,null,null,null,null,null,null,null,null,null,null,null,null,null,null,null,1]
[null,null,"Z1MAG",5,"Ω secondary",null,"2. Only modify yellow cells in this spreadsheet.",null,null,null,null,null,null,null,null,null,null,null,null,null,null,null,null,"Z1MAG RANGE",null,{"$f":"IF(_INOMset=5,0.05,0.25)","v":0.05},{"$f":"IF(_INOMset=5,255,1275)","v":255},null,2]
[null,null,"Z1ANG",80,"degrees",null,"3. Parameters for the second reactance blinder will appear below if applicable.",null,null,null,null,null,null,null,null,null,null,null,null,null,null,null,null,null,null,null,null,null,3]
[null,null,null,null,null,null,null,null,null,null,null,null,null,null,null,null,null,null,null,null,null,null,null,null,null,null,null,null,4]
[null,null,"ZDIRn","F",null,null,"Second Reactance Test Circle",null,null,null,null,null,null,null,null,null,null,null,null,null,null,null,null,null,null,null,null,null,5]
[null,null,"Zxn",3,"Ω secondary",null,"Radius",{"$f":"IF(OR(AND(_H=1,_ZONE=1,ISNUMBER(_rc)),AND(_H=1,_ZONE=2,_EPILOTset<>\"N\",ISNUMBER(_rc))),_rc,\"NA\")","v":16.933521374007107},"Ω secondary",null,null,null,null,null,null,null,null,null,null,null,null,null,null,"ZXn RANGE",null,{"$f":"IF(_INOMset=5,0.05,0.25)","v":0.05},{"$f":"IF(_INOMset=5,64,320)","v":64},null,"N"]
[null,null,"ZxnR",10,"Ω secondary",null,"Center",{"$f":"IF(OR(AND(_H=1,_ZONE=1,ISNUMBER(_rc)),AND(_H=1,_ZONE=2,_EPILOTset<>\"N\",ISNUMBER(_rc))),IMABS(COMPLEX(_hc,_kc)),\"NA\")","v":13.967067149708953},"∠",{"$f":"IF(OR(AND(_H=1,_ZONE=1,ISNUMBER(_rc)),AND(_H=1,_ZONE=2,_EPILOTset<>\"N\",ISNUMBER(_rc))),DEGREES(IMARGUMENT(COMPLEX(_hc,_kc))),\"NA\")","v":-90.550163731939818},"degrees",null,null,null,null,null,null,null,null,null,null,null,null,"ZXnR RANGE",null,{"$f":"IF(_INOMset=5,0.05,0.25)","v":0.05},{"$f":"IF(_INOMset=5,64,320)","v":64},null,"POTT"]
[null,null,"Zx5REV",4,"Ω secondary",null,null,null,null,null,null,null,null,null,null,null,null,null,null,null,null,null,null,"ZX5REV RANGE",null,{"$f":"IF(_INOMset=5,0.05,0.25)","v":0.05},{"$f":"IF(_INOMset=5,64,320)","v":64},null,"DCB"]
[null,null,"ZxnTANG",-3,"degrees"]
[null,null,"Zx1TANG",-3,"degrees"]
[null,null,"k0Mn",0.72699999999999998]
[null,null,"k0An",-3.65,"degrees"]
[null,null,"ZGn_50P",0.5,"A secondary",null,null,null,null,null,null,null,null,null,null,null,null,null,null,null,null,null,null,"ZGn_50P RANGE",null,{"$f":"IF(_INOMset=5,0.5,0.1)","v":0.5},{"$f":"IF(_INOMset=5,100,20)","v":100}]
[null,null,"ZGn_50G",0.5,"A secondary",null,null,null,null,null,null,null,null,null,null,null,null,null,null,null,null,null,null,"ZGn_50G RANGE",null,{"$f":"IF(_INOMset=5,0.5,0.1)","v":0.5},{"$f":"IF(_INOMset=5,100,20)","v":100}]
[null,null,"ZPn_50PP",0.5,"A secondary",null,null,null,null,null,null,null,null,null,null,null,null,null,null,null,null,null,null,"ZPn_50PP RANGE",null,{"$f":"IF(_INOMset=5,0.5,0.1)","v":0.5},{"$f":"IF(_INOMset=5,100,20)","v":100}]
[null,null,"EPILOT","POTT"]
[]
[null,null,"Where :","x=G or P"]
[null,null,null,"n=1,2,3,4,5"]

{"sheet":"Graph","index":1,"n_rows":28,"n_cols":25,"rows_kept":28,"cut":false,"hidden":false,"merged":[[1,13,1,14],[12,13,12,14],[24,13,24,17],[7,17,7,22],[12,21,13,22]]}
[]
[null,null,null,null,null,null,null,null,null,null,null,null,null,"Graph Controls",null,null,null,"Reactance Comparator Check",null,null,null,null,null,null,"Graph Instructions"]
[null,null,null,null,null,null,null,null,null,null,null,null,null,null,null,null,null,"Reactance Comparator Condition (Asserted/Deasserted):",null,null,null,null,null,null,"1. The graph shows the following (colors):"]
[null,null,null,null,null,null,null,null,null,null,null,null,null,null,null,null,null,"X1 (self-polarized reactance)",null,null,null,null,{"$f":"IF(IF(EXACT(_ZONE,\"5\"),AND(_X1<_ZXnset,_X1>-_ZX5REVset),IF(_H>0,_X1<_ZXnset,_X1>-_ZXnset)),\"ASSERTED\",\"DEASSERTED\")","v":"ASSERTED"},null,"•Line angle"]
[null,null,null,null,null,null,null,null,null,null,null,null,null,null,null,null,null,"X2 (I2, I0, and V1 polarized reactance)",null,null,null,null,{"$f":"IF(ISERROR(IF(IF(OR(AND(_H=1,_ZONE=1),AND(_H=1,_ZONE=2,_EPILOTset<>\"N\")), _X2<_ZXnset,\"N/A\"),\"ASSERTED\",\"DEASSERTED\")),\"N/A\",IF(IF(OR(AND(_H=1,_ZONE=1),AND(_H=1,_ZONE=2,_EPILOTset<>\"N\")), _X2<_ZXnset,\"N/A\"),\"ASSERTED\",\"DEASSERTED\"))","v":"ASSERTED"},null,"•Test impedance (X) and vector"]
[null,null,null,null,null,null,null,null,null,null,null,null,null,null,null,null,null,"RB (resistance blinder)",null,null,null,null,{"$f":"_RB","v":0.34632375765282419},null,"•Quadrilateral shape"]
[null,null,null,null,null,null,null,null,null,null,null,null,null,null,null,null,null,null,null,null,null,null,null,null,"•Second reactance blinder arc†"]
[null,null,null,null,null,null,null,null,null,null,null,null,null,null,null,null,null,"Apparent Loop Impedance",null,null,null,null,null,null,"•FS Line (Only shown for PH-PH faults when"]
[null,null,null,null,null,null,null,null,null,null,null,null,null,null,null,null,null,null,{"$f":"IF(EXACT(_FTYPE,\"SLG\"),\"ZAG\",\"ZBC\")","v":"ZAG"},{"$f":"IMABS(IF(EXACT(_FTYPE,\"SLG\"),_ZAG,_ZBC))","v":2.3173012314964367},null,{"$f":"DEGREES(IMARGUMENT(IF(EXACT(_FTYPE,\"SLG\"),_ZAG,_ZBC)))","v":71.536413232257644},null,null,"  Z1ANG>70°)"]
[null,null,null,null,null,null,null,null,null,null,null,null,null,null,null,null,null,null,null,null,null,null,null,null,"  †Not always shown/applicable."]
[]
[]
[null,null,null,null,null,null,null,null,null,null,null,null,null,"Test Values",null,null,null,null,null,null,null,"Supervisory Relay\nWord Bits",null,null,"2.  Zoom, pan, and reset with the graph controls"]
[null,null,null,null,null,null,null,null,null,null,null,null,null,"Apply balanced and nominal prefault voltage for 1 second."]
[null,null,null,null,null,null,null,null,null,null,null,null,null,"Ensure breaker poles closed.",null,null,null,null,null,null,null,{"$f":"IF(EXACT(_FTYPE,\"SLG\"),\"ZAGFS\",\"ZBCFS\")","v":"ZAGFS"},{"$f":"IF(_LOOPDIR,\"ASSERTED\",\"DEASSERTED\")","v":"ASSERTED"},null,"3.  Vary the test currents and angles:"]
[null,null,null,null,null,null,null,null,null,null,null,null,null,null,null,null,null,null,null,null,null,{"$f":"IF(EXACT(_FTYPE,\"SLG\"),\"ZGn_50A\",\"ZPn_50BC\")","v":"ZGn_50A"},{"$f":"IF(IF(EXACT(_FTYPE,\"SLG\"),_ZGn_50A,_ZPn_50BC),\"ASSERTED\",\"DEASSERTED\")","v":"ASSERTED"},null,"•Type the desired values     OR"]
[null,null,null,null,null,null,null,null,null,null,null,null,null,"|VA|",20,null,null,"∠VA",0,null,null,{"$f":"IF(EXACT(_FTYPE,\"SLG\"),\"ZGn_50G\",\"\")","v":"ZGn_50G"},{"$f":"IF(ISERROR(IF(IF(EXACT(_FTYPE,\"SLG\"),_ZGn_50G,\"\"),\"ASSERTED\",\"DEASSERTED\")),\"\",IF(IF(EXACT(_FTYPE,\"SLG\"),_ZGn_50G,\"\"),\"ASSERTED\",\"DEASSERTED\"))","v":"ASSERTED"},null,"•Use the increment/decrement arrows"]
[null,null,null,null,null,null,null,null,null,null,null,null,null,"|VB|",{"$f":"_VNOMset/SQRT(3)","v":66.395280956806971},null,null,"∠VB",{"$f":"_VAANG+DEGREES(IMARGUMENT(_a)+IMARGUMENT(_a))-360","v":-120.00000000000003},null,null,null,null,null,"•Modify the incremental change values"]
[null,null,null,null,null,null,null,null,null,null,null,null,null,"|VC|",{"$f":"_VNOMset/SQRT(3)","v":66.395280956806971},null,null,"∠VC",{"$f":"_VAANG+DEGREES(IMARGUMENT(_a))","v":119.99999999999999},null,null,"Also Check:",null,null,"  on each button press as needed."]
[null,null,null,null,null,null,null,null,null,null,null,null,null,null,null,null,null,null,null,null,null,{"$f":"IF(EXACT(_FTYPE,\"SLG\"),\"ZGnTC=1\",\"ZPnTC=1\")","v":"ZGnTC=1"}]
[null,null,null,null,null,null,null,null,null,null,null,null,null,"|IA|",5,null,null,"∠IA",-70,null,null,{"$f":"IF(EXACT(_FTYPE,\"SLG\"),\"ZLOADAG=0\",\"ZLOADBC=0\")","v":"ZLOADAG=0"},null,null,"4.  Verify reactance blinders are satisfied"]
[null,null,null,null,null,null,null,null,null,null,null,null,null,"|IB|",0,null,null,"∠IB",0,null,null,"LOP=0"]
[null,null,null,null,null,null,null,null,null,null,null,null,null,"|IC|",0,null,null,"∠IC",0,null,null,"VPOLOK=1",null,null,"5.  Verify the supervisory bits."]
[null,null,null,null,null,null,null,null,null,null,null,null,null,null,null,null,null,null,null,null,null,{"$f":"IF(EXACT(_FTYPE,\"SLG\"),\"PSBAG=0\",\"PSBBC=0\")","v":"PSBAG=0"}]
[null,null,null,null,null,null,null,null,null,null,null,null,null,"Incremental Change (Buttons)",null,null,null,null,null,null,null,"PSBIP=0"]
[null,null,null,null,null,null,null,null,null,null,null,null,null,null,"𝛥 |I|",0.1,null,"𝛥 ∠I",1,null,null,{"$f":"IF(EXACT(_FTYPE,\"SLG\"),\"OPA=0\",\"OPB=0\")","v":"OPA=0"}]
[null,null,null,null,null,null,null,null,null,null,null,null,null,null,null,null,null,null,null,null,null,{"$f":"IF(EXACT(_FTYPE,\"SLG\"),\"CVTAG=0\",\"OPC=0\")","v":"CVTAG=0"},{"$f":"IF(EXACT(V27,\"CVTAG=0\"),\"Zone 1 only\",\"\")","v":"Zone 1 only"}]
[null,null,null,null,null,null,null,null,null,null,null,null,null,"All angles are provided in degrees",null,null,null,null,null,null,null,{"$f":"IF(EXACT(_FTYPE,\"SLG\"),\"\",\"CVTBC=0\")","v":""},{"$f":"IF(EXACT(V28,\"CVTBC=0\"),\"Zone 1 only\",\"\")","v":""}]

{"sheet":"Info","index":2,"n_rows":10,"n_cols":2,"rows_kept":10,"cut":false,"hidden":false,"merged":[]}
[]
[]
[null,"This spreadsheet contains macros for the following functions:"]
[null,"1. Button functionality (ie. graph navigation, increment/decrement currents/voltages)."]
[null,"2. Auto-populate current/voltage test values depending on the type of fault and phase rotation selected."]
[null,"3. Auto-reset the graph when clicking on the graph worksheet."]
[]
[null,"Macros are not required for this spreadsheet if the user wishes to manually enter test values and adjust the graph zoom limits.  Worksheets can be unprotected under the Review tab.  There is no password."]
[]
[null,"Macro code is available and can be audited under the Developer tab. To enable the developer tab, go to File->Options->Customize Ribbon.  Then select the Developer checkbox under the Main Tabs heading."]

{"sheet":"Calcs","index":3,"n_rows":698,"n_cols":27,"rows_kept":698,"cut":false,"hidden":true,"merged":[]}
[null,"##Definitions"]
[null,"DR",{"$f":"MAX(0.1*_Z1MAGset,0.5)","v":0.5}]
[null,"DX",{"$f":"MAX(0.2*_Z1MAGset,0.5)","v":1}]
[null,"DANG",{"$f":"70","v":70}]
[null,"a",{"$f":"IF(EXACT(_PHROTset,\"ABC\"),COMPLEX(COS(RADIANS(120)),SIN(RADIANS(120))),COMPLEX(COS(RADIANS(-120)),SIN(RADIANS(-120))))","v":"-0.5+0.866025403784439i"}]
[null,"i",{"$f":"COMPLEX(0,1)","v":"i"}]
[null,"ZXTANGLINE",{"$f":"COMPLEX(COS(RADIANS(_ZXnTANGset)),SIN(RADIANS(_ZXnTANGset)))","v":"0.998629534754574-0.0523359562429438i"}]
[null,"ZX1TANGLINE",{"$f":"IF(_ZONE=2,COMPLEX(COS(RADIANS(_ZX1TANGset)),SIN(RADIANS(_ZX1TANGset))),_ZXTANGLINE)","v":"0.998629534754574-0.0523359562429438i"},null,null,"#When using Zone 2 with EPILOT enabled, user must enter Z1 and Z2 TANG settings."]
[null,"ZXTANGCIRC",{"$f":"IF(_ZONE=2,_ZX1TANGset,_ZXnTANGset)","v":-3}]
[]
[null,"##Direction"]
[null,"H",{"$f":"IF(EXACT(_ZDIRnset,\"F\"),1,-1)","v":1}]
[]
[null,"##Test Values (Complex)"]
[null,"VA",{"$f":"COMPLEX(_VAM*COS(RADIANS(_VAANG)),_VAM*SIN(RADIANS(_VAANG)))","v":"20"},null,null,null,"IA",{"$f":"COMPLEX(_IAM*COS(RADIANS(_IAANG)),_IAM*SIN(RADIANS(_IAANG)))","v":"1.71010071662834-4.69846310392954i"}]
[null,"VB",{"$f":"COMPLEX(_VBM*COS(RADIANS(_VBANG)),_VBM*SIN(RADIANS(_VBANG)))","v":"-33.1976404784035-57.5i"},null,null,null,"IB",{"$f":"COMPLEX(_IBM*COS(RADIANS(_IBANG)),_IBM*SIN(RADIANS(_IBANG)))","v":"0"}]
[null,"VC",{"$f":"COMPLEX(_VCM*COS(RADIANS(_VCANG)),_VCM*SIN(RADIANS(_VCANG)))","v":"-33.1976404784035+57.5i"},null,null,null,"IC",{"$f":"COMPLEX(_ICM*COS(RADIANS(_ICANG)),_ICM*SIN(RADIANS(_ICANG)))","v":"0"}]
[]
[null,"VAB",{"$f":"IMSUB(_VA,_VB)","v":"53.1976404784035+57.5i"},null,null,null,"IAB",{"$f":"IMSUB(_IA,_IB)","v":"1.71010071662834-4.69846310392954i"}]
[null,"VBC",{"$f":"IMSUB(_VB,_VC)","v":"-115i"},null,null,null,"IBC",{"$f":"IMSUB(_IB,_IC)","v":"0"}]
[null,"VCA",{"$f":"IMSUB(_VC,_VA)","v":"-53.1976404784035+57.5i"},null,null,null,"ICA",{"$f":"IMSUB(_IC,_IA)","v":"-1.71010071662834+4.69846310392954i"}]
[]
[null,"##Sequence Comps"]
[null,"I1A",{"$f":"IMPRODUCT(1/3,IMSUM(_IA,IMPRODUCT(_a,_IB),IMPRODUCT(_a,_a,_IC)))","v":"0.570033572209447-1.56615436797651i"}]
[null,"I2A",{"$f":"IMPRODUCT(1/3,IMSUM(_IA,IMPRODUCT(_a,_a,_IB),IMPRODUCT(_a,_IC)))","v":"0.570033572209447-1.56615436797651i"}]
[null,"I2B",{"$f":"IMPRODUCT(_I2A,_a)","v":"1.0713126828109+1.27674073853163i"}]
[null,"I2C",{"$f":"IMPRODUCT(_I2A,_a,_a)","v":"-1.64134625502034+0.289413629444884i"}]
[null,"I0",{"$f":"IMPRODUCT(1/3,IMSUM(_IA,_IB,_IC))","v":"0.570033572209447-1.56615436797651i"}]
[null,"IR",{"$f":"IMSUM(_IA,_IB,_IC)","v":"1.71010071662834-4.69846310392954i"}]
[null,"V1POLA",{"$f":"COMPLEX(_VNOMset/SQRT(3),0)","v":"66.395280956807"}]
[null,"V1POLB",{"$f":"IMPRODUCT(_V1POLA,_a,_a)","v":"-33.1976404784035-57.5000000000001i"}]
[null,"V1POLC",{"$f":"IMPRODUCT(_V1POLA,_a)","v":"-33.1976404784035+57.5000000000001i"}]
[null,"V1POLBC",{"$f":"IMSUB(_V1POLB,_V1POLC)","v":"-115i"}]
[]
[null,"##Misc"]
[null,"Z",{"$f":"COMPLEX(COS(RADIANS(_Z1ANGset)),SIN(RADIANS(_Z1ANGset)))","v":"0.17364817766693+0.984807753012208i"}]
[null,"k0",{"$f":"COMPLEX(_k0Mnset*COS(RADIANS(_k0Anset)),_k0Mnset*SIN(RADIANS(_k0Anset)))","v":"0.72552531928516-0.0462818655216826i"}]
[null,"ZXn",{"$f":"COMPLEX(_ZXnset*COS(RADIANS(_Z1ANGset)),_ZXnset*SIN(RADIANS(_Z1ANGset)))","v":"0.520944533000791+2.95442325903662i"}]
[]
[null,"###############################AG FAULT#####################################",null,null,null,null,null,null,null,"###############################BC/ABC FAULT#####################################"]
[null,"IAG",{"$f":"IMSUM(_IA,IMPRODUCT(_k0,_IR))","v":"2.73336844753524-8.18646369895309i"}]
[]
[null,"ZAG",{"$f":"IMDIV(_VA,_IAG)","v":"0.733893710952269+2.19801842997724i"},null,null,null,null,null,null,"ZBC",{"$f":"IMDIV(IMSUB(_VB,_VC),IMSUB(_IB,_IC))","v":{"$error":"#NUM!"}}]
[]
[]
[null,"XAG1",{"$f":"IMAGINARY(IMPRODUCT(_VA,IMCONJUGATE(IMPRODUCT(_ZXTANGLINE,_IAG))))/IMAGINARY(IMPRODUCT(_IAG,_Z,IMCONJUGATE(IMPRODUCT(_ZXTANGLINE,_IAG))))","v":2.2501877092165845},null,null,null,null,null,null,"XBC1",{"$f":"IMAGINARY(IMPRODUCT(_VBC,IMCONJUGATE(IMPRODUCT(_ZXTANGLINE,_IBC))))/IMAGINARY(IMPRODUCT(_IBC,_Z,IMCONJUGATE(IMPRODUCT(_ZXTANGLINE,_IBC))))","v":{"$error":"#DIV/0!"}}]
[null,"XAG2",{"$f":"IMAGINARY(IMPRODUCT(_VA,IMCONJUGATE(IMPRODUCT(_IPOL2,_IAG))))/IMAGINARY(IMPRODUCT(_IAG,_Z,IMCONJUGATE(IMPRODUCT(_IPOL2,_IAG))))","v":2.2479848197449313},null,null,null,null,null,null,"XBC2",{"$f":"IMAGINARY(IMPRODUCT(_VBC,IMCONJUGATE(IMPRODUCT(_IPOL2,_IBC))))/IMAGINARY(IMPRODUCT(_IBC,_Z,IMCONJUGATE(IMPRODUCT(_IPOL2,_IBC))))","v":{"$error":"#DIV/0!"}}]
[null,"RAGB",{"$f":"IMAGINARY(IMPRODUCT(_Z,_IAG, IMCONJUGATE(_VA)))/(IMPRODUCT(IMAGINARY(_Z),IMABS(_IAG),IMABS(_IAG)))","v":0.34632375765282419},null,null,null,null,null,null,"RBCB",{"$f":"IMAGINARY(IMPRODUCT(_Z,_IBC, IMCONJUGATE(_VBC)))/(IMPRODUCT(IMAGINARY(_Z),IMABS(_IBC),IMABS(_IBC)))","v":{"$error":"#DIV/0!"}}]
[null,null,null,null,"X1",{"$f":"IF(EXACT(_FTYPE,\"SLG\"),C46,K46)","v":2.2501877092165845}]
[null,null,null,null,"X2",{"$f":"IF(EXACT(_FTYPE,\"SLG\"),C47,K47)","v":2.2479848197449313}]
[null,null,null,null,"RB",{"$f":"IF(EXACT(_FTYPE,\"SLG\"),C48,K48)","v":0.34632375765282419}]
[]
[null,"IPOL2AG",{"$f":"IMDIV(IMSUB(IMPRODUCT(3,IMSUM(_I2A,_I0),_ZX1TANGLINE),IMPRODUCT(_i,_K,_V1POLA)),_IAG)","v":"1.24069830794316-0.0571148395459992i"},null,null,null,null,null,null,"IPOL2BC",{"$f":"IMDIV(IMSUB(IMPRODUCT(3,IMSUB(_I2B,_I2C),_ZX1TANGLINE),IMPRODUCT(_i,_K/SQRT(3),_V1POLBC)),_IBC)","v":{"$error":"#NUM!"}}]
[]
[null,null,null,null,null,null,"IPOL2",{"$f":"IF(EXACT(_FTYPE,\"SLG\"),Calcs!C53,Calcs!K53)","v":"1.24069830794316-0.0571148395459992i"},null,null,null,"#2nd Reactance Line  Choose AG or BC Depending on FTYPE"]
[]
[null,"####################DIRECTIONAL SUPERVISION BITS#########################"]
[null,"FSSOPA",{"$f":"_I2A","v":"0.570033572209447-1.56615436797651i"},null,"FSPOLA","FSPOLA",{"$f":"_I0","v":"0.570033572209447-1.56615436797651i"},null,null,null,"THETA (Deg)",30]
[null,"FSSOPB",{"$f":"_I2B","v":"1.0713126828109+1.27674073853163i"},null,"FSPOLBC","FSPOLB",{"$f":"_I0","v":"0.570033572209447-1.56615436797651i"}]
[null,"FSSOPC",{"$f":"_I2C","v":"-1.64134625502034+0.289413629444884i"},null,null,"FSPOLC",{"$f":"_I0","v":"0.570033572209447-1.56615436797651i"}]
[]
[null,"FSSOPBC",{"$f":"IMPRODUCT(IMPRODUCT(-1,_Z),COMPLEX(_H,0),_I2A)","v":"-1.64134625502034-0.289413629444884i"},null,null,"FSPOLBC",{"$f":"_V1POLA","v":"66.395280956807"},null,null,null,"THETA (Deg)",90]
[]
[null,"ZAGFS",{"$f":"AND((IMREAL(IMPRODUCT(_FSSOPA,IMCONJUGATE(_FSPOLA))))>(IMABS(_FSSOPA)*IMABS(_FSPOLA)*COS(RADIANS($L$58))),_50SUPV_I2_G,_50SUPV_I0,_50SUPV_I2I1_G,_50SUPV_I0I1)","v":true}]
[null,"ZBGFS",{"$f":"AND((IMREAL(IMPRODUCT(_FSSOPB,IMCONJUGATE(_FSPOLB))))>(IMABS(_FSSOPB)*IMABS(_FSPOLB)*COS(RADIANS($L$58))),_50SUPV_I2_G,_50SUPV_I0,_50SUPV_I2I1_G,_50SUPV_I0I1)","v":false}]
[null,"ZCGFS",{"$f":"AND((IMREAL(IMPRODUCT(_FSSOPC,IMCONJUGATE(_FSPOLC))))>(IMABS(_FSSOPC)*IMABS(_FSPOLC)*COS(RADIANS($L$58))),_50SUPV_I2_G,_50SUPV_I0,_50SUPV_I2I1_G,_50SUPV_I0I1)","v":false},null,"Final Loop Selection",{"$f":"IF(EXACT(_FTYPE,\"SLG\"),_ZAGFS,_ZBCnFS)","v":true}]
[null,"ZBCFLT",{"$f":"(IMREAL(IMPRODUCT(_FSSOPBC,IMCONJUGATE(_FSPOLBC))))>(IMABS(_FSSOPBC)*IMABS(_FSPOLBC)*COS(RADIANS($L$62)))","v":false}]
[null,"ZBCnFS",{"$f":"OR(AND(OR(_ZBCFLT,EXACT(_ZONE,\"5\")),NOT(OR(_ZBGFS,_ZCGFS)),_50SUPV_I2_P),NOT(_50SUPV_I2I1_P))","v":false}]
[]
[null,"####################OC SUPERVISION BITS#########################"]
[]
[null,"ZGn_50A",{"$f":"IMABS(_IA)>_ZGn_50Pset","v":true},null,"50SUPV_I2_G",{"$f":"3*IMABS(_I2A)>(0.05*_INOMset)","v":true},"#I2 CHECK"]
[null,"ZGn_50G",{"$f":"(3*IMABS(_I0))>_ZGn_50Gset","v":true},null,"50SUPV_I2_P",{"$f":"3*IMABS(_I2A)>(3*0.05*_INOMset)","v":true},"#I2 CHECK"]
[null,"ZPn_50BC",{"$f":"IMABS(_IBC)>_ZPn_50PPset","v":false},null,"50SUPV_I0",{"$f":"3*IMABS(_I0)>(0.05*_INOMset)","v":true},"#I0 CHECK"]
[null,null,null,null,"50SUPV_I2I1_G",{"$f":"IMABS(_I2A)>(0.1*IMABS(_I1A))","v":true},"#I2/I1 RATIO CHECK"]
[null,null,null,null,"50SUPV_I2I1_P",{"$f":"IMABS(_I2A)>(0.15*IMABS(_I1A))","v":true},"#I2/I1 RATIO CHECK"]
[null,null,null,null,"50SUPV_I0I1",{"$f":"IMABS(_I0)>(0.1*IMABS(_I1A))","v":true},"#I0/I1 RATIO CHECK"]
[]
[]
[null,"########################################################PLOTTING################################################################################################################PLOTTING################################################################################################################PLOTTING########################################################"]
{"$rows_left_out":619}
{"sheet":"Revisions","index":4,"n_rows":20,"n_cols":4,"rows_kept":20,"cut":false,"hidden":true,"merged":[]}
[]
[]
[]
[null,"Version",null,"Notes"]
[null,1.01,null,"Initial Release"]
[null,1.02,null,"Modified 2nd reatance blinder for Zone 2 to use the TANG value from Zone 1"]
[null,1.03,null,"Modified Zone 5 to properly model for the reverse setting"]
[null,1.04,null,"Added 2nd reactance blinder circle characteristics. Removed \"initialize\" button."]
[null,1.05,null,"Graph now auto scales when clicking on the tab. Added FS line for PH-PH faults. Modified Quad shapes when reactance blinder is below bottom of quad. "]
[null,null,null,"Modified line equation to better reflect when Z1ANG~90. Added Info tab for macro security information."]
[null,null,null,"Modified Zone 5 when the resistive reach is large and the tilt angle causes both reactance blinders to be above or below the horizontal axis.  "]
[null,null,null,"Modified the graph reset limits for high resistive reach Zone 5 plots."]
[null,1.06,null,"Added OC supervision and ratio checks to the FS logic for scenarios with low sequence currents."]
[null,1.07,null,"Hid the IPOL vector on the graph. Only the curved characteristic is required.  Fixed the test voltage angles for ph-ph faults.  "]
[null,null,null,"This ensures VBC will be at -90 degrees or +90 degrees (depending on phase rotation), and the second reactance blinder (green) is valid."]
[null,null,null,"Cosmetic changes."]
[null,1.08,null,"Added rule so DR and DX >=0.5.  Forced PH-PH voltage test magnitude to be equal."]
[null,1.0900000000000001,null,"Removed the FS line for Zone 5."]
[null,1.1000000000000001,null,"Modified wording on Graph sheet."]
[null,1.1100000000000001,null,"Cosmetic and wording changes."]